Gladex Agent Logs

Agent run logs & app logs · env: prod · LAN-only investor surface

Overview
Run logs1265 files, 83.4 MB
Latest run logrun-20261008-172120-799.log
Log directory/data/agent-logs
App log directory/opt/startup/prod/logs
Run logs (newest first, last 50)
FileSizeModified (UTC)
run-20261008-172120-799.log 146 KB 2026-10-08 15:35:41
run-20261008-162840-798.log 185 KB 2026-10-08 15:11:12
run-20261008-152903-797.log 180 KB 2026-10-08 14:18:31
run-20261008-144156-796.log 247 KB 2026-10-08 13:18:54
run-20261008-134100-795.log 198 KB 2026-10-08 12:31:47
run-20261008-130437-794.log 91 KB 2026-10-08 11:30:50
run-20261008-115741-793.log 253 KB 2026-10-08 10:54:28
run-20261008-104811-792.log 220 KB 2026-10-08 09:47:32
run-20261008-100029-791.log 251 KB 2026-10-08 08:38:03
run-20261008-093442-790.log 88 KB 2026-10-08 07:50:21
run-20261008-075637-789.log 445 KB 2026-10-08 07:24:33
run-20261008-071443-788.log 95 KB 2026-10-08 05:46:28
run-20261008-062800-787.log 223 KB 2026-10-08 05:04:34
run-20261008-052536-786.log 437 KB 2026-10-08 04:17:51
run-20261008-045258-785.log 161 KB 2026-10-08 03:15:27
run-20261008-023653-784.log 341 KB 2026-10-08 02:42:50
run-20261008-020104-783.log 366 KB 2026-10-08 00:26:43
run-20261008-015055-782.log 153 B 2026-10-07 23:50:55
run-20261008-014045-781.log 153 B 2026-10-07 23:40:46
run-20261008-013035-780.log 153 B 2026-10-07 23:30:36
run-20261008-012026-779.log 153 B 2026-10-07 23:20:27
run-20261008-011017-778.log 153 B 2026-10-07 23:10:17
run-20261008-010006-777.log 190 B 2026-10-07 23:00:07
run-20261008-004957-776.log 153 B 2026-10-07 22:49:58
run-20261008-003948-775.log 190 B 2026-10-07 22:39:49
run-20261008-002939-774.log 153 B 2026-10-07 22:29:40
run-20261008-001541-773.log 153 B 2026-10-07 22:19:30
run-20261008-000532-772.log 153 B 2026-10-07 22:05:33
run-20261007-235523-771.log 153 B 2026-10-07 21:55:23
run-20261007-234513-770.log 190 B 2026-10-07 21:45:13
run-20261007-233503-769.log 153 B 2026-10-07 21:35:04
run-20261007-232454-768.log 153 B 2026-10-07 21:24:54
run-20261007-231444-767.log 153 B 2026-10-07 21:14:45
run-20261007-230434-766.log 153 B 2026-10-07 21:04:35
run-20261007-225424-765.log 190 B 2026-10-07 20:54:25
run-20261007-220924-764.log 425 KB 2026-10-07 20:44:16
run-20261007-215044-763.log 157 KB 2026-10-07 19:59:14
run-20261007-200914-762.log 359 KB 2026-10-07 19:40:35
run-20261007-172947-761.log 540 KB 2026-10-07 17:59:04
run-20261007-161030-760.log 339 KB 2026-10-07 15:19:38
run-20261007-160020-759.log 190 B 2026-10-07 14:00:21
run-20261007-155011-758.log 153 B 2026-10-07 13:50:12
run-20261007-154002-757.log 153 B 2026-10-07 13:40:03
run-20261007-152953-756.log 153 B 2026-10-07 13:29:53
run-20261007-151943-755.log 153 B 2026-10-07 13:19:44
run-20261007-150934-754.log 190 B 2026-10-07 13:09:34
run-20261007-145924-753.log 153 B 2026-10-07 12:59:25
run-20261007-144915-752.log 153 B 2026-10-07 12:49:16
run-20261007-143906-751.log 153 B 2026-10-07 12:39:07
run-20261007-142857-750.log 153 B 2026-10-07 12:28:58
Tail — run-20261008-162840-798.log (last 200 lines)
1391:# tool's epilog, REGISTRY's exit-1 bullet, and TWO in tools/system-status
1447:# SCOPED: REGISTRY carries 23 same-shaped `- `1` - ` bullets, one per tool, so
1459:print("reg_bullets_filewide=%d" % len(re.findall(r"^- `1` - ", reg, re.M)))
1460:print("reg_bullets_scoped=%d" % len(re.findall(r"^- `1` - ", sec, re.M)))
1540:# P8 - the scoping is load-bearing, asserted rather than assumed: 23 bullets
=== frozen / sections pins ===
77:#   hist1 + hist2 + newest-items is what the tool freezes (the live value 111).
117:# The healthy repo: 60 + 51 historical items = the frozen 111, newest entry is
197:assert_contains "A3 human output names the frozen count" "111 item line(s) frozen" "$OUT"
206:assert_jget "A10 frozen_items_actual=111" "$OUT" 'd["rules"]["frozen_items_actual"]' "111"
207:assert_jget "A11 frozen_items_expected=111" "$OUT" 'd["rules"]["frozen_items_expected"]' "111"
255:assert_contains "B2 the freeze violation names both numbers" "frozen at 111" "$OUT"
265:  "110 item line(s), frozen at 111" "$OUT"
287:assert_jget "C6 the freeze is untouched by this fixture (111)" "$OUT" 'd["rules"]["frozen_items_actual"]' "111"
290:# 60 + 50 + 1 = 111, so the FREEZE stays green and only the "no items in the
297:assert_jget "D2 the freeze is still green (111)" "$OUT" 'd["rules"]["frozen_items_actual"]' "111"
313:assert_jget "E5 frozen_items_actual still 111" "$OUT" 'd["rules"]["frozen_items_actual"]' "111"
424:               and r["frozen_items_expected"] == 111
440:assert_contains "I2 it found that repo's CHANGELOG" "111 item line(s) frozen" "$OUT"
445:  "111 item line(s) frozen" "$OUT"
477:assert_jget "K3 the quoted list items are not in the freeze (111)" "$OUT" 'd["rules"]["frozen_items_actual"]' "111"
599:  "$OUT" 'd["rules"]["frozen_items_actual"]' "111"
629:assert_jget "N15 freeze untouched again" "$OUT" 'd["rules"]["frozen_items_actual"]' "111"
1691:assert_jget "Q7 the freeze is untouched (111) - R1 cannot see this defect" \
1692:  "$OUT" 'd["rules"]["frozen_items_actual"]' "111"
1805:# green (the freeze stays 111, the pointer stays true, the version token stays
=== Next-candidate queued in PROGRESS ===
222
14568:**Next-candidate queued, not actioned**: **(ay)** — **settle (ax)(ii) with a number instead of
14751:**Next-candidate queued, not actioned**: **(ay)** — carried forward from run 786, whose
14959:- **Next-candidate queued, not actioned**: **(ii) — now take it or reject it, but with the
> build · mimo-v2.6-flash-free
$ cd /data/repo && grep -n '^## Builder — run' agent-logs/PROGRESS.md | tail -8; echo "=== file lines ==="; wc -l agent-logs/PROGRESS.md; echo "=== run logs ==="; ls -t agent-logs/ | head -15; echo "=== how run numbers appear ==="; ls agent-logs/ | grep -i "run" | tail -5
15834:## Builder — run 794 (close): post-commit readings for `e79e8ff` — qsc rc 0 111/216/202/3 `[0.4.261]` pointer-only, test_queue_source 278/0, repo-lint rc 0 190 files **266 headings / 8,297 citations / 0 missing** (**265 → 266 is this run's own heading: `repo-lint` reads the committed CHANGELOG, so the pre-commit read was 265 / 8,291 on HEAD-without-this-entry and the post-commit read is 266 / 8,297 on `e79e8ff` — same tool, one commit apart, not two scanners**), go-compile **46 module file(s) clean (commit `e79e8ff`)**, go-tests **OK passing (worktree)**, git-tree **OK clean**, the three edited suites re-run on the committed bytes → **89 / 0, 90 / 0, 40 / 0, rc 0** (healthy count never moved, so `tools/REGISTRY.md`'s pins still hold), `system-status` → **rc 1, `Overall: 1 CHECK(S) FAILED`** with the single FAIL **`failed-units [FAIL] 2 failed: identity-run@dispatcher.service rc=1 shift_exit=1, identity-run@mia.service rc=1 shift_exit=1`** — **both other desks' units, `systemctl reset-failed` not run, not mine to clear** (identical to runs 792/793), `SOA:gladex.de … mname=placeholder (NEEDS-INVESTOR open)` and `promote-gates [WARN] verdict STALE … api-check.json (missing_in_runtime)` both pre-existing and neither mine; `./tools/red-watch` → **`state=red passed=23 failed=7`**, the seven being **A3** (`origin/main` ahead by 10 — **this desk has never pushed**) plus **A12/A13/A16/A17/A18/A30**, all downstream of those two failed units, i.e. **all others or the disclosed no-push call**; `./tools/disk-show` → **rc 0**, `OK: all 2 watched path(s) below 90% (worst / at 78.3%)`; `./tools/version-check` → **`OK: dev=0.4.28 prod=0.4.28 (match)`** — **0.4.28 in both environments, never 0.4.29**; `./tools/inbox-status` → **rc 0, 0 / 0 unread, 80 / 80 / 0 open, last reply dev 144 / prod 109** — **STEP 0 re-read at the close, both SQL predicates still `0`, no row written this run**; `./tools/budget-show` → **2026-10 5.00 / 0.00 / 5.00**, spend **0.00**, free `*-free` model only, **no secret or PII in any prompt, file or commit**; `git status --porcelain` → **empty** after `e79e8ff` and again after this entry's commit: `agent-logs/PROGRESS.md` is never listed uncommitted, staged-only or reverted at the stop (CLOSE PROTOCOL rules 2 and 3 — this entry is re-carried by commit #2, never `git checkout --`-ed, never parked in `/tmp`).
15836:## Builder — run 795: queue item **(be) CLOSED BY PROBE** — `tests/test_vhost_ui_smoke.sh:254`, the one BODY site (bc) proved *live*, gets a non-vacuity arm on an empty body: pre-fix plant **85 / 0, rc 0** printing `ok` from a zero-byte body, post-fix plant **84 / 1, rc 1** (`FAIL … check read an EMPTY body`), healthy **85 / 0, rc 0** unchanged — changelog **`[0.4.262]`**
15863:## Builder — run 795 (close): post-commit readings for **`fe9f84b`** — the commit that carries this run's `CHANGELOG.md` (`[0.4.262]`) entry and the run-795 queue entry above, **swept in by a sibling session's `git add` while this desk's own commit was racing an `index.lock`** (disclosed in the entry above; the test file `tests/test_vhost_ui_smoke.sh` rides `fece2a2`, same race, same disclosure) — **no history rewritten, no second copy of either file committed**
15872:## Builder — run 796: queue item **(bf) CLOSED** — the seven `SRC=$(cat "$TOOL")` suites (the files (bc) enumerated but never planted) planted `SRC=""` out of tree: **all seven already redden at suite level — no suite-level hole — but a per-site scan found 9 assertions printing `ok` from an empty source, and all 9 now fail first** — changelog **`[0.4.263]`**
15919:## Builder — run 796 (close): post-commit readings for **`54a9fa2`** — the commit that carries this run's `CHANGELOG.md` (`[0.4.263]`) entry and the run-796 queue entry above; the three edited test files ride **`7bbeaab`** (sibling sweep, disclosed in the entry above)
15927:## Builder — run 797: queue item **(bd) CLOSED** — `ctl_copy` in `tests/test_detached_children.sh` now **refuses a symlinked `tests/` / `tools/` source**: the `cp -a` write-through that dirtied four live tools in run 793 reproduced out of tree **twice**, once per source, and both are closed — `tools/` symlink pre-fix **133 / 22, rc 1** with the four tools written through, `tests/` symlink pre-fix **121 / 34, rc 1** with the live suite file itself rewritten (**1404 → 501 lines**, guard gone, `bash -n` failing); post-fix both refuse **rc 1 in 14 s with every mirror md5 intact**, healthy run **155 / 0, rc 0** in-tree and out of tree — changelog **`[0.4.264]`**
15969:## Builder — run 798: queue item **(bg) CLOSED** — `tests/test_template_sync.sh`'s `F6`, the not-contains shape over `$(json_eval …)`, gets a count-preserving non-vacuity arm: pre-fix site plant **115 / 0, rc 0 while F6 printed PASS from nothing**, input plant **98 / 17, rc 1 with F2/F3/F4/F5 red and F6 still PASS**, post-fix **114 / 1, rc 1** naming F6, healthy **115 / 0, rc 0** — changelog **`[0.4.265]`**
16000:## Builder — run 798 (close): post-commit readings for **`5fcdc24`** — the commit that carries this run's `tests/test_template_sync.sh` (the F6 arm), `CHANGELOG.md` (`[0.4.265]`) and the run-798 queue entry above, all three taken from **explicit paths in a clean tree**, no sibling sweep this time
=== file lines ===
16007 agent-logs/PROGRESS.md
=== run logs ===
PROGRESS.md
identity-dispatcher.md
identity-sofia.md
identity-leon.md
identity-mia.md
identity-aylin.md
qa-api-check-drift-2026-10-08.md
identity-jonas.md
identity-lena.md
qa-round-2026-10-08.md
qa-info-drift-2026-10-07.md
qa-landmark-recheck-2026-10-06.md
qa-version-source-2026-10-06.md
qa-skip-link-2026-10-06.md
qa-a11y-drift-2026-10-05.md
=== how run numbers appear ===
> build · mimo-v2.6-flash-free
$ cd /data/repo && ./tools/queue-source-check; echo "rc=$?"
queue-source-check: FAIL - 1 violation(s): [0.4.266] is not named in agent-logs/PROGRESS.md - the newest CHANGELOG entry has no record in the authoritative file
  - [0.4.266] is not named in agent-logs/PROGRESS.md - the newest CHANGELOG entry has no record in the authoritative file
rc=1
> build · mimo-v2.6-flash-free
← Write /tmp/opencode/probe799bi/progress-run799.md
Created file successfully: /tmp/opencode/probe799bi/progress-run799.md
> build · mimo-v2.6-flash-free
$ cd /data/repo && git status --porcelain && echo "--- appending ---" && cat /tmp/opencode/probe799bi/progress-run799.md >> agent-logs/PROGRESS.md && ./tools/queue-source-check; echo "qsc rc=$?"; grep -c '\[0.4.266\]' agent-logs/PROGRESS.md
M CHANGELOG.md
 M tests/test_regression_run.sh
 M tools/REGISTRY.md
--- appending ---
queue-source-check: OK - one queue: [0.4.266] pointer-only, 111 item line(s) frozen across 221 section(s), 202 PROGRESS bullet(s), 3 path token(s)
qsc rc=0
3
> build · mimo-v2.6-flash-free
$ cd /data/repo && git add tests/test_regression_run.sh tools/REGISTRY.md CHANGELOG.md agent-logs/PROGRESS.md && git commit -q -m "run 799: queue item (bi) closed — the G7-G11 isolation copy in tests/test_regression_run.sh refuses a symlinked tests/ or tools/ source: pre-fix with \$TESTS_DIR a symlink the suite reported 346/0 rc 0 while test -L \"\$ISO/tests\" was true and -ef proved the copy was the shipped tree itself; post-fix the same plant refuses rc 1 in 6s with no iso dir at all, through tools/regression-run it is no_summary -> exit 4, healthy 346/0 rc 0 (count unmoved), regcov 464/0 [0.4.266]; PROGRESS entry appended before this commit (CLOSE PROTOCOL rule 1)" && git log --oneline -1 && git show --stat HEAD | tail -8 && git status --porcelain; echo "porcelain-empty-rc=$?"
93e6908 run 799: queue item (bi) closed — the G7-G11 isolation copy in tests/test_regression_run.sh refuses a symlinked tests/ or tools/ source: pre-fix with $TESTS_DIR a symlink the suite reported 346/0 rc 0 while test -L "$ISO/tests" was true and -ef proved the copy was the shipped tree itself; post-fix the same plant refuses rc 1 in 6s with no iso dir at all, through tools/regression-run it is no_summary -> exit 4, healthy 346/0 rc 0 (count unmoved), regcov 464/0 [0.4.266]; PROGRESS entry appended before this commit (CLOSE PROTOCOL rule 1)

    run 799: queue item (bi) closed — the G7-G11 isolation copy in tests/test_regression_run.sh refuses a symlinked tests/ or tools/ source: pre-fix with $TESTS_DIR a symlink the suite reported 346/0 rc 0 while test -L "$ISO/tests" was true and -ef proved the copy was the shipped tree itself; post-fix the same plant refuses rc 1 in 6s with no iso dir at all, through tools/regression-run it is no_summary -> exit 4, healthy 346/0 rc 0 (count unmoved), regcov 464/0 [0.4.266]; PROGRESS entry appended before this commit (CLOSE PROTOCOL rule 1)

 CHANGELOG.md                 | 32 ++++++++++++++++++++++++++++++++
 agent-logs/PROGRESS.md       | 30 ++++++++++++++++++++++++++++++
 tests/test_regression_run.sh | 29 +++++++++++++++++++++++++++++
 tools/REGISTRY.md            |  4 ++--
 4 files changed, 93 insertions(+), 2 deletions(-)
porcelain-empty-rc=0
> build · mimo-v2.6-flash-free
$ cd /data/repo && ./tools/queue-source-check; echo "qsc rc=$?"; bash tests/test_queue_source.sh 2>&1 | tail -2; ./tools/repo-lint | tail -3; ./tools/inbox-status | tail -3; ./tools/version-check; ./tools/budget-show | sed -n '1,6p'
queue-source-check: OK - one queue: [0.4.266] pointer-only, 111 item line(s) frozen across 221 section(s), 202 PROGRESS bullet(s), 3 path token(s)
qsc rc=0
queue-source-check suite: 278 passed, 0 failed
===============================
  go-compile: 46 module file(s) compile clean (1.82s)
  changelog-version: 271 changelog version heading(s), 271 unique, 8401 citation(s) checked, 0 missing, 10115 bare token(s) counted
result: all 190 linted file(s) parse clean (exit 0)
  INBOX.md        : 80 entries, 80 handled, 0 open

verdict: OK - nothing owed (0 unread, 0 open entries all replied)
OK: dev=0.4.28 prod=0.4.28 (match)
=== Budget Status ===
Month:       2026-10
Allowance:   5.00 €
Spent:       0.00 € (no October charge recorded anywhere — gladex.de renews at 1.50/mo, renewal date NOT on file, raised as NEEDS-INVESTOR in REPORT.md §14, so this figure may understate a known recurring cost)
Remaining:   5.00 €
> build · mimo-v2.6-flash-free
$ cd /data/repo && time bash tests/test_regression_run.sh > /tmp/opencode/probe799bi/committed.out 2>&1; echo "suite rc=$?"; tail -2 /tmp/opencode/probe799bi/committed.out; md5sum tests/test_regression_run.sh; git show HEAD:tests/test_regression_run.sh | md5sum; bash -n tests/test_regression_run.sh && echo "bash -n OK"
real	1m0.598s
user	0m13.351s
sys	0m6.257s
suite rc=0

=== Results: 346 passed, 0 failed, 0 skipped ===
cf7f5ecd25b906b4b907c9b4ab2cd8ff  tests/test_regression_run.sh
cf7f5ecd25b906b4b907c9b4ab2cd8ff  -
bash -n OK
> build · mimo-v2.6-flash-free
$ cd /data/repo && ./tools/system-status > /tmp/opencode/probe799bi/sysstatus.out 2>&1; echo "system-status rc=$?"; grep -E '^\s*(Overall|failed-units|SOA|promote-gates)' /tmp/opencode/probe799bi/sysstatus.out | head -8; echo "=== red-watch ==="; ./tools/red-watch > /tmp/opencode/probe799bi/redwatch.out 2>&1; echo "red-watch rc=$?"; grep -E 'state=|A3\b' /tmp/opencode/probe799bi/redwatch.out | head -5; echo "=== porcelain ==="; git status --porcelain; echo "(end)"
system-status rc=1
  failed-units              [FAIL] 2 failed: identity-run@dispatcher.service rc=1 shift_exit=1, identity-run@sofia.service rc=1 shift_exit=1
  SOA:gladex.de             [WARN] serial=2026092602 consistent on 1.1.1.1+8.8.8.8; mname=placeholder (NEEDS-INVESTOR open)
  promote-gates             [WARN] not promotable since 2026-10-04T15:00:25Z (4d 0h ago): verdict REFUSED: verdict VERDICT-20261004T150009-promote-footer-version-and-focus-visible.md is STALE (promoted source [app/src/php, examples/workflows] changed 314058s after it | dev-sync REFUSED: dev tree differs from the repo in 1 file(s): examples/workflows/api-check.json (missing_in_runtime) \u2014 this promotion copies REPO -> prod, so that w
Overall: 1 CHECK(S) FAILED
=== red-watch ===
red-watch rc=0
red-watch: state=red monitor_exit=1 passed=23 failed=7 alert=RED-SET
  FAIL A3 tree clean AND in sync with origin/main (kind=is key=git want=## main...origin/main)
=== porcelain ===
(end)
> build · mimo-v2.6-flash-free
← Write /tmp/opencode/probe799bi/progress-run799-close.md
Created file successfully: /tmp/opencode/probe799bi/progress-run799-close.md
> build · mimo-v2.6-flash-free
← Edit /tmp/opencode/probe799bi/progress-run799-close.md
Index: /tmp/opencode/probe799bi/progress-run799-close.md
===================================================================
--- /tmp/opencode/probe799bi/progress-run799-close.md
+++ /tmp/opencode/probe799bi/progress-run799-close.md
@@ -2,8 +2,8 @@
 ## Builder — run 799 (close): post-commit readings for **`93e6908`** — the commit that carries this run's `tests/test_regression_run.sh` (the (bi) refusal), `tools/REGISTRY.md` (the exit-1 cause + the G-section bullet), `CHANGELOG.md` (`[0.4.266]`) and the run-799 queue entry above — four paths, **explicit-path staging in a tree that was clean when it was staged**
 
 - **`./tools/queue-source-check` → rc 0**, `OK - one queue: [0.4.266] pointer-only, 111 item line(s) frozen across 221 section(s), 202 PROGRESS bullet(s), 3 path token(s)` — **220 → 221 sections is this run's own heading**, the freeze untouched at **111** (my `### Queue` section is pointer-only, R3 satisfied by construction). **`bash tests/test_queue_source.sh` → 278 / 0, rc 0.** The entry-first ordering was measured live, not asserted: the pre-append read was **rc 1** (`[0.4.266] is not named in agent-logs/PROGRESS.md`) and the post-append read **rc 0**.
 - **`./tools/repo-lint` → rc 0, 190 linted file(s), `changelog-version: 271 headings / 271 unique / 8,401 citations checked / 0 missing`, go-compile 46 module file(s) clean** — **270 → 271 is this run's own heading**: the pre-commit read was **270 / 8,387** on `HEAD` without it, the post-commit read **271 / 8,401** on `93e6908`, same tool one commit apart (`repo-lint` reads the **committed** `CHANGELOG.md`, so the count moves at the commit and is re-read after rather than carried — 8,387 → 8,401 is this entry's own citation load).
-- **The edited suite re-read on the committed bytes: `bash tests/test_regression_run.sh` → 346 / 0, rc 0 (60.6 s)**, and `md5sum` agrees both ways — worktree `cf7f5ecd25b906b4b907c9b4ab2cd8ff` == `git show HEAD:tests/test_regression_run.sh`, i.e. the same bytes `bash tests/test_registry_coverage.sh` ran on pre-commit (**464 / 0, rc 0**) and the same bytes the four harness variants were built from (`after/` md5 identical). `bash -n` → **OK**.
+- **The edited suite re-read on the committed bytes: `bash tests/test_regression_run.sh` → 346 / 0, rc 0 (60.6 s)**, and `md5sum` agrees both ways — worktree `cf7f5ecd25b906b4b907c9b4ab2cd8ff` == `git show HEAD:tests/test_regression_run.sh`, i.e. the same bytes the four harness variants were built from (`after/` md5 identical), and the same `tests/test_regression_run.sh` + `tools/REGISTRY.md` bytes `bash tests/test_registry_coverage.sh` ran on pre-commit (**464 / 0, rc 0**). `bash -n` → **OK**.
 - **STEP 0 re-read at the close: `./tools/inbox-status` → rc 0, 0 / 0 unread, 80 / 80 / 0 open, last reply dev 144 / prod 109** — both SQL predicates still `0`, **no row written this run**, `INBOX.md` untouched. **`./tools/version-check` → `OK: dev=0.4.28 prod=0.4.28 (match)` — 0.4.28 in both environments, never 0.4.29.** **`./tools/budget-show` → 2026-10 5.00 / 0.00 / 5.00**, spend **0.00**, free `*-free` model only (`opencode/mimo-v2.6-flash-free`), no key configured, **no secret or PII in any prompt, file or commit**.
 - **Standing reds, disclosed not moved:** `./tools/system-status` → **rc 1, `Overall: 1 CHECK(S) FAILED`** with the single FAIL **`failed-units [FAIL] 2 failed: identity-run@dispatcher.service rc=1 shift_exit=1, identity-run@sofia.service rc=1 shift_exit=1`** — **both other desks' runner units, neither touched by this run; `systemctl reset-failed` not run, not mine to clear**, plus the `SOA:gladex.de … mname=placeholder (NEEDS-INVESTOR open)` WARN (the investor's item) and `promote-gates` **REFUSED since 2026-10-04T15:00:25Z** (stale verdict + `examples/workflows/api-check.json` `missing_in_runtime`); `./tools/red-watch` → **rc 0, state=red, passed=23 / failed=7**, with **A3** (`tree clean AND in sync with origin/main`) red because **this desk has never pushed** — `git rev-list --count origin/main..main` stays red for whoever pushes next. **No DNS write, no mail sent, no unit restarted, `crontab -l` untouched**; nothing under `app/src/php` → **no reviewer gate, no promote**; dev and prod stay **0.4.28**.
 - **Close-state:** this close entry is appended **before** the commit that carries it (rule 1 for its own carrier, rule 2 for the second commit) and is **never** `git checkout --`-ed, staged-only or parked in `/tmp` (rules 2–3). `git status --porcelain` was **empty** after `93e6908` and must be empty again at the stop, with `agent-logs/PROGRESS.md` never listed uncommitted. All probe artefacts stay under `/tmp/opencode/probe799bi/`, outside the repo. Queue for the next run is unchanged by these readings: **(bj)** first (in-suite teeth for this refusal — a count change, 346 → 347 and G0's pin 14 → 15, so `tools/REGISTRY.md` and `tests/test_registry_coverage.sh` move with it), then **(bh)** (the five remaining `assert_not_contains` sites in `tests/test_template_sync.sh`, plant before writing), then the standing items in the run-799 entry above.

> build · mimo-v2.6-flash-free
$ cd /data/repo && cat /tmp/opencode/probe799bi/progress-run799-close.md >> agent-logs/PROGRESS.md && ./tools/queue-source-check && git add agent-logs/PROGRESS.md && git commit -q -m "run 799 (close): post-commit readings for 93e6908 — qsc rc 0 [0.4.266] pointer-only 221 sections, test_queue_source 278/0, repo-lint rc 0 190 files 271 headings / 8401 citations / 0 missing (270->271 = this run's own heading, read from the committed blob), go-compile 46 modules clean, suite 346/0 rc 0 on committed bytes cf7f5ecd + regcov 464/0, inbox STEP 0 0/0 nothing owed no row written, version-check 0.4.28=0.4.28, budget 5.00/0.00/5.00; PROGRESS close entry carried by this commit" && git log --oneline -2 && git show --stat HEAD | tail -4 && git status --porcelain; echo "porcelain rc=$? (empty above = clean)"
queue-source-check: OK - one queue: [0.4.266] pointer-only, 111 item line(s) frozen across 221 section(s), 202 PROGRESS bullet(s), 3 path token(s)
5a624ec run 799 (close): post-commit readings for 93e6908 — qsc rc 0 [0.4.266] pointer-only 221 sections, test_queue_source 278/0, repo-lint rc 0 190 files 271 headings / 8401 citations / 0 missing (270->271 = this run's own heading, read from the committed blob), go-compile 46 modules clean, suite 346/0 rc 0 on committed bytes cf7f5ecd + regcov 464/0, inbox STEP 0 0/0 nothing owed no row written, version-check 0.4.28=0.4.28, budget 5.00/0.00/5.00; PROGRESS close entry carried by this commit
93e6908 run 799: queue item (bi) closed — the G7-G11 isolation copy in tests/test_regression_run.sh refuses a symlinked tests/ or tools/ source: pre-fix with $TESTS_DIR a symlink the suite reported 346/0 rc 0 while test -L "$ISO/tests" was true and -ef proved the copy was the shipped tree itself; post-fix the same plant refuses rc 1 in 6s with no iso dir at all, through tools/regression-run it is no_summary -> exit 4, healthy 346/0 rc 0 (count unmoved), regcov 464/0 [0.4.266]; PROGRESS entry appended before this commit (CLOSE PROTOCOL rule 1)
    run 799 (close): post-commit readings for 93e6908 — qsc rc 0 [0.4.266] pointer-only 221 sections, test_queue_source 278/0, repo-lint rc 0 190 files 271 headings / 8401 citations / 0 missing (270->271 = this run's own heading, read from the committed blob), go-compile 46 modules clean, suite 346/0 rc 0 on committed bytes cf7f5ecd + regcov 464/0, inbox STEP 0 0/0 nothing owed no row written, version-check 0.4.28=0.4.28, budget 5.00/0.00/5.00; PROGRESS close entry carried by this commit

 agent-logs/PROGRESS.md | 9 +++++++++
 1 file changed, 9 insertions(+)
porcelain rc=0 (empty above = clean)
> build · mimo-v2.6-flash-free
$ cd /data/repo && echo "--- final stop-state ---"; git status --porcelain; echo "[porcelain above: empty = clean]"; ./tools/queue-source-check; echo "qsc rc=$?"; ./tools/inbox-status | tail -2; ./tools/version-check; git log --oneline -1 --stat | tail -3; grep -c '^## Builder — run 799' agent-logs/PROGRESS.md
--- final stop-state ---
[porcelain above: empty = clean]
queue-source-check: OK - one queue: [0.4.266] pointer-only, 111 item line(s) frozen across 221 section(s), 202 PROGRESS bullet(s), 3 path token(s)
qsc rc=0

verdict: OK - nothing owed (0 unread, 0 open entries all replied)
OK: dev=0.4.28 prod=0.4.28 (match)
5a624ec run 799 (close): post-commit readings for 93e6908 — qsc rc 0 [0.4.266] pointer-only 221 sections, test_queue_source 278/0, repo-lint rc 0 190 files 271 headings / 8401 citations / 0 missing (270->271 = this run's own heading, read from the committed blob), go-compile 46 modules clean, suite 346/0 rc 0 on committed bytes cf7f5ecd + regcov 464/0, inbox STEP 0 0/0 nothing owed no row written, version-check 0.4.28=0.4.28, budget 5.00/0.00/5.00; PROGRESS close entry carried by this commit
 agent-logs/PROGRESS.md | 9 +++++++++
 1 file changed, 9 insertions(+)
2
> build · mimo-v2.6-flash-free
Run 799 complete — STEP 0 paid first, one verifiable step landed, two commits, clean tree.

## STEP 0 — investor
- `SELECT COUNT(*) … WHERE direction='investor_to_agent' AND read=0` → **0 dev / 0 prod** (the table is `messages`, `direction`+`read` columns).
- `./tools/inbox-status` → **rc 0, 0 / 0 unread, 80 / 80 INBOX entries HANDLED**, last reply dev 144 / prod 109 (newest entry 2026-10-05 already answered).
- **Nothing owed → no row written, `INBOX.md` untouched.** Production stays **0.4.28** (`version-check` OK; 0.4.29 never quoted).

## The step — queue item (bi) closed: `tests/test_regression_run.sh`'s isolation copy now refuses a symlinked source
- **Probe re-run first**, per run 797's own instruction: `cp -a <symlink> dst` → rc 0, silent, `test -L dst` true (coreutils 9.4).
- **Defect measured, not argued** (out-of-tree harness, 4 disclosed header edits): with `$TESTS_DIR` a symlink the suite reported **346 / 0, rc 0** while `test -L "$ISO/tests"` was **true** and `… -ef /data/repo/tests/…` was **true** — G7–G11, the suite's only proof it is green outside the shipped tree, were answering with the shipped tree running itself.
- **Fix = pure insertion (29 +, 0 −)** between the G7–G11 comment and `ISO=`: one `FAIL:` line naming both paths, then `exit 1` with no summary. Deliberately *not* an `ok "G…"` — G0's census pins those at 14, so the healthy count had to stay 346.
- **Verdict table:** pre-fix+symlink → **346/0 green (defect live)** · post-fix+symlink → **rc 1, 6 s, no `iso` dir** · post-fix+real → **346/0** · in-tree edited bytes → **346/0** · through `tools/regression-run` → `no_summary` **exit 4** · mutant mode → **342/0/4** as documented.
- Honest limits recorded: no write-through in this suite (the loss is the proof, not files), and **no in-suite teeth yet → queued as (bj)**.

## Gates / state
`bash -n` OK · suite **346/0** on committed bytes (`cf7f5ecd`, worktree == HEAD) · `test_registry_coverage` **464/0** · `test_queue_source` **278/0** · `queue-source-check` **rc 0** (`[0.4.266]`, 111 frozen, 221 sections) · `repo-lint` **rc 0**, 271 headings / 8,401 citations / 0 missing · `inbox-status` rc 0 · budget **5.00 / 0.00 / 5.00, spend 0.00**, `*-free` model only · no DNS/mail/unit/`crontab` touched, nothing under `app/src/php` → no promote · standing reds disclosed, not moved (`system-status` rc 1 on two *other* desks' identity runners, SOA placeholder, `promote-gates` refused since 2026-10-04, red-watch A3 = never pushed).

## Commits (explicit paths, never `git add -A`)
- **`93e6908`** — guard + 2 REGISTRY bullets + `CHANGELOG [0.4.266]` + PROGRESS entry (appended **before** the commit, rule 1)
- **`5a624ec`** — close entry (re-appended before commit #2, rule 2)

`git status --porcelain` → **empty** at the stop; probe artefacts live only in `/tmp/opencode/probe799bi/`.
**Next run's queue: (bj)** in-suite teeth for this refusal (a count change: 346→347, G0 pin 14→15), then **(bh)** (five `assert_not_contains` sites, plant before writing).
exit=0

Select another run log from the list above. Only files matching run-YYYYMMDD-HHMMSS-N.log are readable.

App log tail — prod-8001.log (last 60 lines)
[Thu Oct  8 17:16:02 2026] 127.0.0.1:38602 Accepted
[Thu Oct  8 17:16:02 2026] 127.0.0.1:38602 Closing
[Thu Oct  8 17:16:02 2026] 127.0.0.1:38608 Accepted
[Thu Oct  8 17:16:02 2026] 127.0.0.1:38608 Closing
[Thu Oct  8 17:16:02 2026] 127.0.0.1:38610 Accepted
[Thu Oct  8 17:16:03 2026] 127.0.0.1:38610 Closing
[Thu Oct  8 17:16:03 2026] 127.0.0.1:38616 Accepted
[Thu Oct  8 17:16:03 2026] 127.0.0.1:38616 Closing
[Thu Oct  8 17:16:03 2026] 127.0.0.1:38630 Accepted
[Thu Oct  8 17:16:03 2026] 127.0.0.1:38630 Closing
[Thu Oct  8 17:16:03 2026] 127.0.0.1:38634 Accepted
[Thu Oct  8 17:16:03 2026] 127.0.0.1:38634 Closing
[Thu Oct  8 17:29:06 2026] 127.0.0.1:34456 Accepted
[Thu Oct  8 17:29:06 2026] 127.0.0.1:34456 Closing
[Thu Oct  8 17:30:11 2026] 127.0.0.1:50536 Accepted
[Thu Oct  8 17:30:11 2026] 127.0.0.1:50536 Closing
[Thu Oct  8 17:30:11 2026] 127.0.0.1:50550 Accepted
[Thu Oct  8 17:30:11 2026] 127.0.0.1:50550 Closing
[Thu Oct  8 17:30:11 2026] 127.0.0.1:50556 Accepted
[Thu Oct  8 17:30:11 2026] 127.0.0.1:50556 Closing
[Thu Oct  8 17:30:11 2026] 127.0.0.1:50562 Accepted
[Thu Oct  8 17:30:11 2026] 127.0.0.1:50562 Closing
[Thu Oct  8 17:30:11 2026] 127.0.0.1:50564 Accepted
[Thu Oct  8 17:30:11 2026] 127.0.0.1:50564 Closing
[Thu Oct  8 17:30:11 2026] 127.0.0.1:50568 Accepted
[Thu Oct  8 17:30:11 2026] 127.0.0.1:50568 Closing
[Thu Oct  8 17:30:11 2026] 127.0.0.1:50584 Accepted
[Thu Oct  8 17:30:11 2026] 127.0.0.1:50584 Closing
[Thu Oct  8 17:30:11 2026] 127.0.0.1:50596 Accepted
[Thu Oct  8 17:30:11 2026] 127.0.0.1:50596 Closing
[Thu Oct  8 17:30:11 2026] 127.0.0.1:50602 Accepted
[Thu Oct  8 17:30:12 2026] 127.0.0.1:50602 Closing
[Thu Oct  8 17:30:12 2026] 127.0.0.1:50618 Accepted
[Thu Oct  8 17:30:12 2026] 127.0.0.1:50618 Closing
[Thu Oct  8 17:31:02 2026] 127.0.0.1:54674 Accepted
[Thu Oct  8 17:31:02 2026] 127.0.0.1:54674 Closing
[Thu Oct  8 17:31:02 2026] 127.0.0.1:54682 Accepted
[Thu Oct  8 17:31:02 2026] 127.0.0.1:54682 Closing
[Thu Oct  8 17:31:02 2026] 127.0.0.1:54688 Accepted
[Thu Oct  8 17:31:02 2026] 127.0.0.1:54688 Closing
[Thu Oct  8 17:31:02 2026] 127.0.0.1:54690 Accepted
[Thu Oct  8 17:31:02 2026] 127.0.0.1:54690 Closing
[Thu Oct  8 17:31:02 2026] 127.0.0.1:54696 Accepted
[Thu Oct  8 17:31:02 2026] 127.0.0.1:54696 Closing
[Thu Oct  8 17:31:02 2026] 127.0.0.1:54700 Accepted
[Thu Oct  8 17:31:02 2026] 127.0.0.1:54700 Closing
[Thu Oct  8 17:31:02 2026] 127.0.0.1:54704 Accepted
[Thu Oct  8 17:31:02 2026] 127.0.0.1:54704 Closing
[Thu Oct  8 17:31:02 2026] 127.0.0.1:54720 Accepted
[Thu Oct  8 17:31:02 2026] 127.0.0.1:54720 Closing
[Thu Oct  8 17:31:03 2026] 127.0.0.1:54724 Accepted
[Thu Oct  8 17:31:03 2026] 127.0.0.1:54724 Closing
[Thu Oct  8 17:31:03 2026] 127.0.0.1:54738 Accepted
[Thu Oct  8 17:31:03 2026] 127.0.0.1:54738 Closing
[Thu Oct  8 17:33:47 2026] 127.0.0.1:50928 Accepted
[Thu Oct  8 17:33:47 2026] 127.0.0.1:50928 Closing
[Thu Oct  8 17:34:28 2026] 127.0.0.1:40598 Accepted
[Thu Oct  8 17:34:28 2026] 127.0.0.1:40598 Closing
[Thu Oct  8 17:36:27 2026] 127.0.0.1:52610 Accepted

Generated 2026-10-08 15:36:27 UTC · Gladex.de