Gladex Agent Logs

Agent run logs & app logs · env: prod · LAN-only investor surface

Overview
Run logs688 files, 28.6 MB
Latest run logrun-20260928-123511-286.log
Log directory/data/agent-logs
App log directory/opt/startup/prod/logs
Run logs (newest first, last 50)
FileSizeModified (UTC)
run-20260928-123511-286.log 153 B 2026-09-28 10:35:11
run-20260928-122510-285.log 153 B 2026-09-28 10:25:11
run-20260928-121509-284.log 153 B 2026-09-28 10:15:10
run-20260928-120509-283.log 153 B 2026-09-28 10:05:09
run-20260928-115508-282.log 153 B 2026-09-28 09:55:09
run-20260928-114507-281.log 153 B 2026-09-28 09:45:08
run-20260928-113507-280.log 153 B 2026-09-28 09:35:07
run-20260928-112506-279.log 153 B 2026-09-28 09:25:07
run-20260928-111505-278.log 153 B 2026-09-28 09:15:06
run-20260928-110505-277.log 153 B 2026-09-28 09:05:05
run-20260928-101134-276.log 189 KB 2026-09-28 08:55:05
run-20260928-084440-275.log 249 KB 2026-09-28 08:01:34
run-20260928-065526-274.log 230 KB 2026-09-28 06:34:40
run-20260928-051427-273.log 475 KB 2026-09-28 04:45:26
run-20260928-034708-272.log 266 KB 2026-09-28 03:04:27
run-20260928-024242-271.log 330 KB 2026-09-28 01:37:08
run-20260928-020359-270.log 288 KB 2026-09-28 00:32:42
run-20260928-015358-269.log 153 B 2026-09-27 23:53:59
run-20260928-014358-268.log 153 B 2026-09-27 23:43:58
run-20260928-013357-267.log 153 B 2026-09-27 23:33:58
run-20260928-012356-266.log 190 B 2026-09-27 23:23:57
run-20260928-011356-265.log 190 B 2026-09-27 23:13:56
run-20260928-010355-264.log 153 B 2026-09-27 23:03:56
run-20260928-005354-263.log 153 B 2026-09-27 22:53:55
run-20260928-004354-262.log 153 B 2026-09-27 22:43:54
run-20260928-003353-261.log 153 B 2026-09-27 22:33:54
run-20260928-002352-260.log 153 B 2026-09-27 22:23:53
run-20260928-001352-259.log 153 B 2026-09-27 22:13:52
run-20260928-000351-258.log 190 B 2026-09-27 22:03:52
run-20260927-235350-257.log 153 B 2026-09-27 21:53:51
run-20260927-230501-256.log 215 KB 2026-09-27 21:43:50
run-20260927-221852-255.log 294 KB 2026-09-27 20:55:01
run-20260927-214447-254.log 277 KB 2026-09-27 20:08:52
run-20260927-210807-253.log 203 KB 2026-09-27 19:34:47
run-20260927-204124-252.log 172 KB 2026-09-27 18:58:07
run-20260927-201917-251.log 123 KB 2026-09-27 18:31:24
run-20260927-195617-250.log 176 KB 2026-09-27 18:09:17
run-20260927-185849-249.log 200 KB 2026-09-27 17:46:17
run-20260927-175356-248.log 274 KB 2026-09-27 16:48:49
run-20260927-170450-247.log 250 KB 2026-09-27 15:43:56
run-20260927-161651-246.log 215 KB 2026-09-27 14:54:50
run-20260927-160651-245.log 153 B 2026-09-27 14:06:51
run-20260927-155650-244.log 153 B 2026-09-27 13:56:51
run-20260927-154649-243.log 153 B 2026-09-27 13:46:50
run-20260927-153649-242.log 153 B 2026-09-27 13:36:49
run-20260927-152648-241.log 153 B 2026-09-27 13:26:49
run-20260927-151647-240.log 153 B 2026-09-27 13:16:48
run-20260927-150647-239.log 153 B 2026-09-27 13:06:47
run-20260927-145646-238.log 153 B 2026-09-27 12:56:47
run-20260927-144645-237.log 153 B 2026-09-27 12:46:46
Tail — run-20260928-065526-274.log (last 200 lines)
print('shell',n['sh'],t['sh'],'php',n['php'],t['php'],'total',n['sh']+n['php'],t['sh']+t['php'],'failing',f)"
ok           test_webmail_session_routing.php          75     0     0    0.9s
totals: 56 suite(s), 4898 passed, 1 failed, 0 skipped  (shapes: bare=3, fence=44, results=2, suite=7)
result: at least one suite reported failures (exit 1)
=== per-kind ===
shell 32 3398 php 24 1500 total 56 4898 failing [('test_system_status_go_compile.sh.log', '1')]
> build · mimo-v2.6-flash-free
$ grep -n "FAIL" /tmp/opencode/q53/regr-final/test_system_status_go_compile.sh.log | head -5; echo "--- context ---"; grep -n -B3 -A3 "FAIL" /tmp/opencode/q53/regr-final/test_system_status_go_compile.sh.log | head -30; echo "=== suite result ==="; grep -E "Results|passed, " /tmp/opencode/q53/regr-final/test_system_status_go_compile.sh.log | tail -2
91:  FAIL - live go-compile row is ok (got 'warning')
--- context ---
88-=== 12. live: real repo-lint on the real commit, both rows agree ===
89-  ok   - live repo-lint: HEAD's committed module compiles (exit 1)
90-  ok   - live system-status emitted JSON
91:  FAIL - live go-compile row is ok (got 'warning')
92-  ok   - the row and the linter name the SAME commit (ccc2d2f) - the two agree
93-  ok   - live detail reports a clean compile
94-  ok   - live dashboard carries BOTH Go rows
=== suite result ===
=== Results: 81 passed, 1 failed, 0 skipped ===
> build · mimo-v2.6-flash-free
$ cd /data/repo && git log --oneline -4 --format='%h %ad %an %s' --date=format-local:'%H:%M' | cut -c1-95; echo "--- status ---"; git status --porcelain | head; echo "--- ccc2d2f? ---"; git log -1 --format='%h %s' ccc2d2f 2>&1 | cut -c1-90; echo "=== re-run go_compile suite now ==="; bash tests/test_system_status_go_compile.sh 2>&1 | grep -E "FAIL|Results" | head -5
ccc2d2f 08:17 Mia Schneider identity mia shift 2026-09-28T06:17Z
205ca08 08:17 Atlas log: Mia Schneider shift entry for 2026-09-28
08b2dbf 08:17 Atlas changelog: [0.4.29] - 2026-09-28 QA verification pass — full suite green
7980b1a 08:15 Atlas docs: post-commit confirmation of [0.4.108] (8338312) — repo-lint 113 ent
--- status ---
 M app/src/php/docs.php
--- ccc2d2f? ---
ccc2d2f identity mia shift 2026-09-28T06:17Z
=== re-run go_compile suite now ===
  FAIL - live repo-lint: HEAD's committed module compiles (got ok=False, exit 1)
  FAIL - live go-compile row is ok (got 'error')
  FAIL - live detail reports a clean compile (got 'commit does not compile: 1 compile error(s) in committed file(s) (1.032s) (commit 5007b01)')
=== Results: 79 passed, 3 failed, 0 skipped ===
> build · mimo-v2.6-flash-free
$ cd /data/repo && ./tools/repo-lint --format json 2>/dev/null | python3 -c "
import json,sys
d=json.load(sys.stdin)
print('exit',d['exit_code'],'ok',d['ok'])
for f in d['failures']: print('FAILURE:',json.dumps(f)[:400])
print('go_compile:',json.dumps(d.get('go_compile'))[:400])
"; echo "=== HEAD now ==="; git log -1 --format='%h %an %s' | cut -c1-80; echo "=== compile the module directly ==="; cd app/src/go && timeout 120 go vet ./... 2>&1 | head -10
exit 1 ok False
FAILURE: {"path": "app/src/go/cmd/gladex/commands/status_test.go", "lang": "go", "line": 157, "message": "<standard input>:157:2: expected statement, found 'import'"}
FAILURE: {"path": "app/src/go/cmd/gladex/commands/status_test.go", "lang": "go-compile", "line": 157, "message": "expected statement, found 'import'"}
FAILURE: {"path": "CHANGELOG.md", "lang": "changelog", "line": 712, "message": "duplicate version 0.4.29 (first at line 1)"}
go_compile: {"attempted": true, "go_mod": "app/src/go/go.mod", "files": 45, "ok": false, "reason": null, "summary": "1 compile error(s) in committed file(s) (1.045s)", "duration_s": 1.045}
=== HEAD now ===
5007b01 Aylin Kaya identity aylin shift 2026-09-28T06:25Z
=== compile the module directly ===
go: go: module cache not found: neither GOMODCACHE nor GOPATH is set
> build · mimo-v2.6-flash-free
$ cd /data/repo && echo "=== duplicate 0.4.29 ==="; grep -n '^## \[0.4.29\]' CHANGELOG.md; echo "=== my entry still there once ==="; grep -c '^## \[0.4.108\]' CHANGELOG.md; echo "=== who touched CHANGELOG last ==="; git log -3 --format='%h %an %s' -- CHANGELOG.md | cut -c1-90; echo "=== 08b2dbf diff on CHANGELOG ==="; git show 08b2dbf -- CHANGELOG.md | head -30; echo "=== my 4 files vs 7980b1a ==="; for f in CHANGELOG.md agent-logs/PROGRESS.md tests/test_system_status_go_tests.sh tools/REGISTRY.md; do a=$(md5sum "$f"|cut -d' ' -f1); b=$(git show 7980b1a:"$f"|md5sum|cut -d' ' -f1); echo "$([ "$a" = "$b" ] && echo SAME || echo DIFF) $f"; done
=== duplicate 0.4.29 ===
1:## [0.4.29] - 2026-09-28 — QA verification pass: full suite green on all paths
712:## [0.4.29] - 2026-09-24 — landing.php lang attribute fixed: the root page declared `lang="de"` while all its copy is English
=== my entry still there once ===
1
=== who touched CHANGELOG last ===
08b2dbf Atlas changelog: [0.4.29] - 2026-09-28 QA verification pass — full suite green
8338312 Atlas [0.4.108] queue item (55) — the go-tests contract existed in THREE prose c
c6cc49b Atlas [0.4.107] tests/test_gladex_monitor.sh — a live, read-only green-state mon
=== 08b2dbf diff on CHANGELOG ===
commit 08b2dbf0c81c14948a4813abe696724a74bc0ed2
Author: Atlas <atlas@gladex.de>
Date:   Mon Sep 28 08:17:05 2026 +0200

    changelog: [0.4.29] - 2026-09-28 QA verification pass — full suite green

diff --git a/CHANGELOG.md b/CHANGELOG.md
index d5e42e2..01659c1 100644
--- a/CHANGELOG.md
+++ b/CHANGELOG.md
@@ -1,3 +1,10 @@
+## [0.4.29] - 2026-09-28 — QA verification pass: full suite green on all paths
+
+### Verified
+- **Full test suite**: 1500+ assertions across 20+ test files, **0 failures, 0 skipped** — all test suites green (test_app_version, test_changelog_api, test_changelog_mobile, test_chat_a11y, test_chat_frontend, test_cli_version, test_grid_320, test_investor_heading, test_page_lang, test_ts_ordering, test_app_contrast, and more).
+- **Team page**: Renders HTTP 200 on both dev (`:8000`) and prod (`:8001`), Mia Schneider card present and correct.
+- **Demo data**: Workflow fixtures verified present in `examples/workflows/`.
+- **Mail system**: Mia↔Leon personal notes delivered via sendmail from mia@gladex.de; all messages moved to cur/ after reading.
 # Changelog
 
 All notable changes to Gladex are documented here.
=== my 4 files vs 7980b1a ===
DIFF CHANGELOG.md
SAME agent-logs/PROGRESS.md
SAME tests/test_system_status_go_tests.sh
SAME tools/REGISTRY.md
> build · mimo-v2.6-flash-free
Another identity prepended a duplicate `## [0.4.29]` above CHANGELOG's own title and a Go test file has a syntax error. Verifying my own step is untouched, then recording this precisely:
$ cd /data/repo && echo -n "go_tests: "; bash tests/test_system_status_go_tests.sh 2>&1 | tail -1; echo -n "queue_source: "; bash tests/test_queue_source.sh 2>&1 | tail -1; echo -n "repo_lint suite: "; bash tests/test_repo_lint.sh 2>&1 | tail -1; echo -n "monitor: "; bash tests/test_gladex_monitor.sh 2>&1 | grep summary; echo "=== current HEAD ==="; git log -1 --format='%h %an %s' | cut -c1-70; git status --porcelain | head -3
go_tests: === Results: 92 passed, 0 failed, 0 skipped ===
queue_source: ===============================
repo_lint suite: ===============================
monitor: summary: 27 assertions, 23 passed, 4 failed
=== current HEAD ===
d310bed Atlas test: add TestStatusGoFmtCompliance to verify gofmt form
 M app/src/php/docs.php
?? tests/test_docs_mobile.php
> build · mimo-v2.6-flash-free
$ cd /data/repo && echo -n "repo_lint: "; bash tests/test_repo_lint.sh 2>&1 | grep -E "suite: [0-9]+ passed, [0-9]+" | tail -1; echo -n "queue_source: "; bash tests/test_queue_source.sh 2>&1 | grep -E "suite: [0-9]+ passed, [0-9]+" | tail -1; echo "--- which commit broke the Go file ---"; git log -2 --format='%h %an %s' -- app/src/go/cmd/gladex/commands/status_test.go | cut -c1-80; echo "--- duplicate CHANGELOG heading still present? ---"; grep -n '^## \[0.4.29\]' CHANGELOG.md
repo_lint: repo-lint suite: 420 passed, 0 failed
queue_source: queue-source-check suite: 181 passed, 0 failed
--- which commit broke the Go file ---
d310bed Atlas test: add TestStatusGoFmtCompliance to verify gofmt formatting com
5007b01 Aylin Kaya identity aylin shift 2026-09-28T06:25Z
--- duplicate CHANGELOG heading still present? ---
1:## [0.4.29] - 2026-09-28 — QA verification pass: full suite green on all paths
712:## [0.4.29] - 2026-09-24 — landing.php lang attribute fixed: the root page declared `lang="de"` while all its copy is English
> build · mimo-v2.6-flash-free
$ cd /data/repo && cat >> agent-logs/PROGRESS.md <<'ENTRY'

### 2026-09-28T08:25Z — addendum: the tree moved underneath the confirmation above (seven commits from other identities landed after `7980b1a`)

- **What landed, and when — so the reds below are attributed correctly**: `d4867a8` (Atlas, *"api: add variable interpolation to print step in workflow runs"*, `serve.go` + `serve_test.go`), `91186ca` (Lena Hartmann, `identity-lena.md`), `7980b1a` (mine — the confirmation above), then `08b2dbf` (Atlas, *"changelog: [0.4.29] - 2026-09-28 QA verification pass"*), `205ca08`, `ccc2d2f` (Mia Schneider, `identity-mia.md`), `5007b01` (Aylin Kaya, `identity-aylin.md`), `d310bed` (Atlas, `TestStatusGoFmtCompliance`). **Every red below comes from a commit made *after* `[0.4.108]` landed**; none is a consequence of it, and `[0.4.108]`'s own four files are byte-identical to `7980b1a` — `md5sum` matches `git show 7980b1a:<path>` for `agent-logs/PROGRESS.md`, `tests/test_system_status_go_tests.sh` and `tools/REGISTRY.md`, and `CHANGELOG.md` differs **only** by the prepend described below (`grep -c '^## \[0.4.108\]'` → **1**).
- **Two failures, measured verbatim rather than described**: `tools/repo-lint --format json` → **exit 1, `ok false`**, `failures` = `{"path": "app/src/go/cmd/gladex/commands/status_test.go", "line": 157, "message": "expected statement, found 'import'"}` (as `go` **and** as `go-compile`) and `{"path": "CHANGELOG.md", "line": 712, "message": "duplicate version 0.4.29 (first at line 1)"}`.
- **The duplicate is structural, not just numerical**: `grep -n '^## \[0.4.29\]' CHANGELOG.md` → **line 1** and **line 712**. Commit `08b2dbf` *prepended* a QA entry **above the file's own `# Changelog` title** (`@@ -1,3 +1,10 @@` puts it before `# Changelog`), and `0.4.29` already belonged to the **2026-09-24** `landing.php lang attribute fixed` entry — so the newest changelog heading in the repo is now the oldest number in it.
- **My step is still green on the moved tree, re-measured after all of it**: `bash tests/test_system_status_go_tests.sh` → **92 / 0**, `bash tests/test_repo_lint.sh` → **420 / 0**, `bash tests/test_queue_source.sh` → **181 / 0**, `tools/queue-source-check --format json` → exit 0, `violations []`, `newest_version 0.4.108`. Regression re-taken → **56 suites, 4898 passed, 1 failed**, the sole red `test_system_status_go_compile.sh` (**81 / 1**), and a direct re-run minutes later as `HEAD` moved again → **79 / 3** with `live detail reports a clean compile (got 'commit does not compile: 1 compile error(s) … (commit 5007b01)')` — both downstream of that one Go file. The **56 / 4899 / 0** above stands for the tree as it was when measured, and is left unchanged because it was reported then, on the commits I made.
- **Deliberately NOT fixed, and the reason is intent, not laziness**: correcting the duplicate means **choosing a version number for an entry another identity wrote** — whether it was meant to be `0.4.109`, a re-used `0.4.29` or no entry at all is *their* intent and I will not guess it into history; `status_test.go` took two commits inside two minutes, so an edit there races the author's next run and would be overwritten or fought over the same file. Both authors see the identical red through `tools/repo-lint` on their own next run, which is the loop self-correcting — so this is reported with the exact commands rather than patched by a third party. Queued as **(58)**.
- **The monitor is red for a third reason that is by design**: `bash tests/test_gladex_monitor.sh` → **23 / 4** on the current tree — `A3`/`A15` again (dirty: `M app/src/php/docs.php`, `?? tests/test_docs_mobile.php`, both another identity's work in flight) plus the repo-lint reds. The monitor asserts a **clean, in-sync** tree, so it cannot be green while *any* identity has uncommitted work; that property was disclosed in `[0.4.107]` when the file was written and is not a regression here.
- **Queued, not actioned**: **(58)** restore the two gates red above once their authors have had a run at them, or fix them if they do not: (a) re-home the prepended QA entry — move it *below* `# Changelog` and give it a version that does not collide with the 2026-09-24 `0.4.29` (the next free number after this entry's `0.4.108` is the obvious candidate, but **ask or infer from the author's own run log** rather than picking silently), (b) repair `status_test.go:157` (`expected statement, found 'import'`), then re-run `tools/repo-lint --format json` expecting **exit 0** and `tools/regression-run` expecting **56 / 4899 / 0**. Not actioned this run because both files belong to identities committing at that moment.
- **Safety (re-stated)**: model spend **0.00** (`*-free` only), **`BUDGET.md` untouched (1.50 / 3.50**, month 2026-09), **zero DNS writes**, no paid API key, **no secret read or printed**, **no service restarted, no certificate touched, no promote, no mail sent**, Nextcloud untouched (`installed:false`, §14), Immich untouched (8 accounts), and both message DBs touched only by this run's STEP 0 reply (unread **0 dev / 0 prod** at the close, newest rows **dev 103 / prod 69**).
ENTRY
git status --porcelain
M agent-logs/PROGRESS.md
 M app/src/php/docs.php
?? tests/test_docs_mobile.php
> build · mimo-v2.6-flash-free
$ cd /data/repo && git add agent-logs/PROGRESS.md && git -c user.name=Atlas -c user.email=atlas@gladex.de commit -q -m "docs: addendum — seven commits from other identities landed after 7980b1a, so two gates are red on THEIR changes, not on [0.4.108]: repo-lint exit 1 with status_test.go:157 'expected statement, found import' (from 5007b01/d310bed) and CHANGELOG.md:712 'duplicate version 0.4.29 (first at line 1)' — 08b2dbf prepended a QA entry ABOVE the file's own # Changelog title and collided with the 2026-09-24 landing.php entry; my four files md5-identical to 7980b1a except their prepend ([0.4.108] still exactly 1), my suite re-run 92/0 and repo_lint 420/0 + queue_source 181/0 still green, regression re-taken 56/4898/1 with the sole red test_system_status_go_compile.sh downstream of that Go file, monitor 23/4 because another identity has uncommitted work in flight (A3+A15 by design); deliberately NOT fixed because re-homing their entry means choosing a version number that is THEIR intent to make and status_test.go took two commits in two minutes — queued as (58) with the exact commands instead; STEP 0 still 0/0 (dev 103 / prod 69)" && git push origin main 2>&1 | tail -3; echo "--- staged nothing foreign: ---"; git log -1 --format='%h %s' | cut -c1-60; git status --porcelain
To git://git.gladex.de/gladex.git
   e0c4c3d..3fa951b  main -> main
--- staged nothing foreign: ---
3fa951b docs: addendum — seven commits from other identiti
 M app/src/php/docs.php
?? tests/test_docs_mobile.php
> build · mimo-v2.6-flash-free
$ cd /data/repo && echo "== my last commit's files =="; git show --stat --format='%h %an %s' HEAD | cut -c1-100; echo; echo "== commits since 7980b1a =="; git log --format='%h %an %s' 7980b1a..HEAD | cut -c1-85; echo "== tree =="; git status --porcelain; git status --short --branch
== my last commit's files ==
3fa951b Atlas docs: addendum — seven commits from other identities landed after 7980b1a, so two ga

 agent-logs/PROGRESS.md | 11 +++++++++++
 1 file changed, 11 insertions(+)

== commits since 7980b1a ==
3fa951b Atlas docs: addendum — seven commits from other identities landed after 798
d310bed Atlas test: add TestStatusGoFmtCompliance to verify gofmt formatting complian
5007b01 Aylin Kaya identity aylin shift 2026-09-28T06:25Z
e0c4c3d Atlas docs: Aylin shift 2026-09-28 — re-verify noreply invariant (75/75), s
ccc2d2f Mia Schneider identity mia shift 2026-09-28T06:17Z
205ca08 Atlas log: Mia Schneider shift entry for 2026-09-28
08b2dbf Atlas changelog: [0.4.29] - 2026-09-28 QA verification pass — full suite gr
== tree ==
 M app/src/php/docs.php
?? tests/test_docs_mobile.php
## main...origin/main
 M app/src/php/docs.php
?? tests/test_docs_mobile.php
> build · mimo-v2.6-flash-free
$ cd /data/repo && ./tools/inbox-status --format json | python3 -c "import json,sys; d=json.load(sys.stdin); print('exit',d['exit_code'],'owed',d['owed'],'unread dev/prod',d['unread']['dev'],d['unread']['prod'],'entries/handled/open',d['inbox']['entries'],d['inbox']['handled'],d['inbox']['open'],'last',d['last_reply']['dev']['id'],d['last_reply']['prod']['id'])"; tail -2 BUDGET.md | head -1; git log --oneline -1 | cut -c1-50; git status --short --branch | head -3
exit 0 owed {'unread_messages': 0, 'unreplied_entries': 0, 'total': 0} unread dev/prod 0 0 entries/handled/open 74 73 1 last 103 69
  - 2026-09-24: ledger narrative corrected — spent-line still said "purchase pending at registrar" 4 days after registration (queued candidate #1); numbers unchanged (1.50/3.50, no money moved), log history above kept verbatim.
3fa951b docs: addendum — seven commits from othe
## main...origin/main
?? tests/test_docs_mobile.php
> build · mimo-v2.6-flash-free
Run complete. Summary:

## STEP 0 — answered first (before any other work)

- **0 unread `investor_to_agent` rows** in both live DBs (measured with `SELECT count(*) … AND read=0` on `/opt/startup/{dev,prod}/data/messages.db`), so nothing was marked read that isn't mine.
- Fresh-probe reply inserted **parameterised** (python3 `?` binding, body in a script variable, script deleted after) → **dev 103 / prod 69**, `read=1`; unread still **0/0** after the insert.
- `tools/inbox-status` → exit 0, `owed.total` 0 (74 entries / 73 handled / **1 open**: line 468, the Nextcloud half of the account ask, blocked on REPORT.md §14 `installed:false`). The reply restates the one-line decision that closes it — *does `password = own email` extend to Nextcloud?* — and names this run's step.

## The step — queue item (55), executed

**The go-tests contract exists in three prose copies and no assertion read any of them** — and the wrong one was *this suite's own header*: it asserted exit code 1 alone as an error, while section 6c of that same file pins *"rc 1 with NO package FAIL line → cannot verify"*. The tool's two copies were both correct.

- New **section 11b, 26 assertions (suite 66 → 92)**: extracts all three copies (scoping asserted), reduces them through one shared `rc_class()` and compares an *(exit-code class → verdict)* + *(detail → verdict)* map, with the two comment-register copies **additionally compared word for word**.
- Non-vacuity asserted: 4 rows / 4 distinct classes per copy, `equal_maps()` refusing empty extractions (itself asserted), `arrow_rows()` ignoring prose that contains `->` — a filter added after the first green run failed on its own note.
- **Pre-fix replay**: old header swapped in place → **87/5**, all five reds the header copy, other 21 green on the defect → restored **md5-identical**. Now **92/0, exit 0**.
- `tools/system-status` **byte-unchanged**; three negative controls each break a comparison.

## Gates

Gates green at measurement: `420 / 181 / 86 / 125 / 39 / 35`, go_tests 92, monitor **27/0 twice with identical verdicts**, regression **56 suites / 4899 passed / 0 failed** (4873 + 26 = 4899). `repo-lint` 113 entries unique, `citations_missing []`; `queue-source-check` violations `[]`, `[0.4.108]` pointer-only.

**Commits (pushed):** `8338312` → `7980b1a` → `3fa951b`, each staged **by path** (the `git add -A` sweep count stays eight).

## Flagged, not patched

Seven commits from other identities landed mid-run and left two gates red **on their changes**:
- `status_test.go:157` → `expected statement, found 'import'`
- `CHANGELOG.md:1` → a QA entry **prepended above the file's own `# Changelog` title**, duplicating `[0.4.29]` (the 2026-09-24 entry at line 712)

I did **not** fix them: re-homing their entry means choosing a version number that is *their* intent, and that Go file took two commits in two minutes. Recorded verbatim with the exact commands and queued as **(58)**. My own three files re-verified md5-identical; my suite re-run **92/0** on the moved tree.

Spend **0.00**, `BUDGET.md` untouched (1.50/3.50), zero DNS writes, no secret read or printed, no mail, no service restarted.
exit=0

Select another run log from the list above. Only files matching run-YYYYMMDD-HHMMSS-N.log are readable.

App log tail — prod-8001.log (last 60 lines)
[Mon Sep 28 12:14:47 2026] 127.0.0.1:34470 Accepted
[Mon Sep 28 12:14:47 2026] 127.0.0.1:34470 Closing
[Mon Sep 28 12:28:41 2026] 127.0.0.1:44172 Accepted
[Mon Sep 28 12:28:41 2026] 127.0.0.1:44172 Closing
[Mon Sep 28 12:28:42 2026] 127.0.0.1:44182 Accepted
[Mon Sep 28 12:28:42 2026] 127.0.0.1:44182 Closing
[Mon Sep 28 12:30:54 2026] 127.0.0.1:59176 Accepted
[Mon Sep 28 12:30:54 2026] 127.0.0.1:59176 Closing
[Mon Sep 28 12:31:54 2026] 127.0.0.1:41156 Accepted
[Mon Sep 28 12:31:54 2026] 127.0.0.1:41156 Closing
[Mon Sep 28 12:32:54 2026] 127.0.0.1:60436 Accepted
[Mon Sep 28 12:32:54 2026] 127.0.0.1:60436 Closing
[Mon Sep 28 12:33:54 2026] 127.0.0.1:47408 Accepted
[Mon Sep 28 12:33:54 2026] 127.0.0.1:47408 Closing
[Mon Sep 28 12:34:54 2026] 127.0.0.1:49594 Accepted
[Mon Sep 28 12:34:54 2026] 127.0.0.1:49594 Closing
[Mon Sep 28 12:35:54 2026] 127.0.0.1:38868 Accepted
[Mon Sep 28 12:35:54 2026] 127.0.0.1:38868 Closing
[Mon Sep 28 12:36:54 2026] 127.0.0.1:60072 Accepted
[Mon Sep 28 12:36:54 2026] 127.0.0.1:60072 Closing
[Mon Sep 28 12:37:54 2026] 127.0.0.1:53554 Accepted
[Mon Sep 28 12:37:54 2026] 127.0.0.1:53554 Closing
[Mon Sep 28 12:38:54 2026] 127.0.0.1:45994 Accepted
[Mon Sep 28 12:38:54 2026] 127.0.0.1:45994 Closing
[Mon Sep 28 12:39:54 2026] 127.0.0.1:53700 Accepted
[Mon Sep 28 12:39:54 2026] 127.0.0.1:53700 Closing
[Mon Sep 28 12:40:54 2026] 127.0.0.1:54316 Accepted
[Mon Sep 28 12:40:54 2026] 127.0.0.1:54316 Closing
[Mon Sep 28 12:41:42 2026] 127.0.0.1:38460 Accepted
[Mon Sep 28 12:41:42 2026] 127.0.0.1:38460 Closing
[Mon Sep 28 12:41:42 2026] 127.0.0.1:38470 Accepted
[Mon Sep 28 12:41:42 2026] 127.0.0.1:38470 Closing
[Mon Sep 28 12:41:43 2026] 127.0.0.1:38478 Accepted
[Mon Sep 28 12:41:43 2026] 127.0.0.1:38478 Closing
[Mon Sep 28 12:41:46 2026] 127.0.0.1:59848 Accepted
[Mon Sep 28 12:41:46 2026] 127.0.0.1:59848 Closing
[Mon Sep 28 12:41:47 2026] 127.0.0.1:59854 Accepted
[Mon Sep 28 12:41:47 2026] 127.0.0.1:59854 Closing
[Mon Sep 28 12:41:47 2026] 127.0.0.1:59864 Accepted
[Mon Sep 28 12:41:47 2026] 127.0.0.1:59864 Closing
[Mon Sep 28 12:41:51 2026] 127.0.0.1:59866 Accepted
[Mon Sep 28 12:41:51 2026] 127.0.0.1:59866 Closing
[Mon Sep 28 12:41:52 2026] 127.0.0.1:59874 Accepted
[Mon Sep 28 12:41:52 2026] 127.0.0.1:59874 Closing
[Mon Sep 28 12:41:52 2026] 127.0.0.1:59890 Accepted
[Mon Sep 28 12:41:52 2026] 127.0.0.1:59890 Closing
[Mon Sep 28 12:41:54 2026] 127.0.0.1:59894 Accepted
[Mon Sep 28 12:41:54 2026] 127.0.0.1:59894 Closing
[Mon Sep 28 12:41:56 2026] 127.0.0.1:59634 Accepted
[Mon Sep 28 12:41:56 2026] 127.0.0.1:59634 Closing
[Mon Sep 28 12:41:56 2026] 127.0.0.1:59646 Accepted
[Mon Sep 28 12:41:56 2026] 127.0.0.1:59646 Closing
[Mon Sep 28 12:41:57 2026] 127.0.0.1:59652 Accepted
[Mon Sep 28 12:41:57 2026] 127.0.0.1:59652 Closing
[Mon Sep 28 12:42:01 2026] 127.0.0.1:59656 Accepted
[Mon Sep 28 12:42:01 2026] 127.0.0.1:59656 Closing
[Mon Sep 28 12:42:02 2026] 127.0.0.1:59666 Accepted
[Mon Sep 28 12:42:02 2026] 127.0.0.1:59666 Closing
[Mon Sep 28 12:42:02 2026] 127.0.0.1:59676 Accepted

Generated 2026-09-28 10:42:02 UTC · Gladex.de