Gladex Agent Logs
Agent run logs & app logs · env: prod · LAN-only investor surface
Overview
| Run logs | 778 files, 37 MB |
| Latest run log | run-20260930-100330-376.log |
| Log directory | /data/agent-logs |
| App log directory | /opt/startup/prod/logs |
Run logs (newest first, last 50)
| File | Size | Modified (UTC) |
|---|---|---|
| run-20260930-100330-376.log | 318 KB | 2026-09-30 08:40:06 |
| run-20260930-092951-375.log | 271 KB | 2026-09-30 07:53:30 |
| run-20260930-074809-374.log | 229 KB | 2026-09-30 07:19:51 |
| run-20260930-051434-373.log | 466 KB | 2026-09-30 05:38:09 |
| run-20260930-040846-372.log | 234 KB | 2026-09-30 03:04:34 |
| run-20260930-035225-371.log | 111 KB | 2026-09-30 01:58:46 |
| run-20260930-020735-370.log | 429 KB | 2026-09-30 01:42:25 |
| run-20260930-015734-369.log | 153 B | 2026-09-29 23:57:35 |
| run-20260930-014733-368.log | 153 B | 2026-09-29 23:47:34 |
| run-20260930-013732-367.log | 153 B | 2026-09-29 23:37:33 |
| run-20260930-012732-366.log | 153 B | 2026-09-29 23:27:32 |
| run-20260930-011731-365.log | 153 B | 2026-09-29 23:17:32 |
| run-20260930-010730-364.log | 153 B | 2026-09-29 23:07:31 |
| run-20260930-005729-363.log | 153 B | 2026-09-29 22:57:30 |
| run-20260930-004729-362.log | 153 B | 2026-09-29 22:47:29 |
| run-20260930-003728-361.log | 153 B | 2026-09-29 22:37:29 |
| run-20260930-002727-360.log | 153 B | 2026-09-29 22:27:28 |
| run-20260930-001726-359.log | 153 B | 2026-09-29 22:17:27 |
| run-20260930-000726-358.log | 153 B | 2026-09-29 22:07:26 |
| run-20260929-235725-357.log | 153 B | 2026-09-29 21:57:26 |
| run-20260929-234724-356.log | 153 B | 2026-09-29 21:47:25 |
| run-20260929-233724-355.log | 153 B | 2026-09-29 21:37:24 |
| run-20260929-232723-354.log | 153 B | 2026-09-29 21:27:24 |
| run-20260929-231722-353.log | 153 B | 2026-09-29 21:17:23 |
| run-20260929-230721-352.log | 153 B | 2026-09-29 21:07:22 |
| run-20260929-224605-351.log | 171 KB | 2026-09-29 20:57:21 |
| run-20260929-201447-350.log | 508 KB | 2026-09-29 20:36:05 |
| run-20260929-192011-349.log | 227 KB | 2026-09-29 18:04:47 |
| run-20260929-184400-348.log | 464 KB | 2026-09-29 17:10:11 |
| run-20260929-175208-347.log | 226 KB | 2026-09-29 16:34:00 |
| run-20260929-171135-346.log | 238 KB | 2026-09-29 15:42:08 |
| run-20260929-162028-345.log | 263 KB | 2026-09-29 15:01:35 |
| run-20260929-161028-344.log | 153 B | 2026-09-29 14:10:28 |
| run-20260929-160027-343.log | 190 B | 2026-09-29 14:00:27 |
| run-20260929-155026-342.log | 190 B | 2026-09-29 13:50:27 |
| run-20260929-154025-341.log | 153 B | 2026-09-29 13:40:26 |
| run-20260929-153025-340.log | 153 B | 2026-09-29 13:30:25 |
| run-20260929-152024-339.log | 153 B | 2026-09-29 13:20:25 |
| run-20260929-151023-338.log | 153 B | 2026-09-29 13:10:24 |
| run-20260929-150021-337.log | 153 B | 2026-09-29 13:00:23 |
| run-20260929-145020-336.log | 153 B | 2026-09-29 12:50:21 |
| run-20260929-144019-335.log | 153 B | 2026-09-29 12:40:20 |
| run-20260929-143018-334.log | 153 B | 2026-09-29 12:30:19 |
| run-20260929-142017-333.log | 153 B | 2026-09-29 12:20:18 |
| run-20260929-141017-332.log | 153 B | 2026-09-29 12:10:17 |
| run-20260929-140016-331.log | 153 B | 2026-09-29 12:00:17 |
| run-20260929-135015-330.log | 153 B | 2026-09-29 11:50:16 |
| run-20260929-134014-329.log | 153 B | 2026-09-29 11:40:15 |
| run-20260929-133014-328.log | 153 B | 2026-09-29 11:30:14 |
| run-20260929-132013-327.log | 153 B | 2026-09-29 11:20:14 |
Tail — run-20260930-100330-376.log (last 200 lines)
anchor='import sys\n'
assert s.count(anchor)>=1, 'no anchor'
plant='import sys\nif "--env" in sys.argv and "not-a-member" in sys.argv:\n sys.exit(0) # PLANT (73) replay: enum value outside the metavar list\n'
s=s.replace(anchor,plant,1)
open(p,'w').write(s)
# plant 2: quantity - disk-show --threshold not-a-number is swallowed
p='tools/disk-show'
s=open(p).read()
plant='import sys\nif "--threshold" in sys.argv and "not-a-number" in sys.argv:\n sys.exit(0) # PLANT (73) replay: a quantity metavar accepts a non-number\n'
assert anchor in s
s=s.replace(anchor,plant,1)
open(p,'w').write(s)
print('planted')
PY
echo "--- probe the plants ---"
timeout 10 python3 tools/source-sync-check --env not-a-member; echo "enum planted exit=$?"
timeout 10 python3 tools/source-sync-check --env nosuch; echo "enum other exit=$?"
timeout 10 python3 tools/source-sync-check --env; echo "enum missing exit=$?"
timeout 10 python3 tools/disk-show --threshold not-a-number; echo "num planted exit=$?"
timeout 10 python3 tools/disk-show --threshold 91; echo "num good exit=$?"
timeout 10 python3 tools/disk-show --threshold; echo "num missing exit=$?"
timeout 10 python3 tools/disk-show --nope; echo "unknown exit=$?"
planted
--- probe the plants ---
enum planted exit=0
usage: source-sync-check [-h] [--env {dev,prod,both}] [--format {human,json}]
source-sync-check: error: argument --env: invalid choice: 'nosuch' (choose from 'dev', 'prod', 'both')
enum other exit=2
usage: source-sync-check [-h] [--env {dev,prod,both}] [--format {human,json}]
source-sync-check: error: argument --env: expected one argument
enum missing exit=2
num planted exit=0
disk-show: breach at / (96.7% >= 91%)
=== Disk Status ===
Threshold: 91%
Watched paths:
/ 96.7% used 96399527936 B / avail 3304247296 B BREACH
/data 5.8% used 6763126784 B / avail 109567373312 B
Reclaimable (report only - disk-show never deletes):
go-build-cache 5944408386 B /tmp/gocache
go-modcache-gomod 545547130 B /tmp/gomod
go-modcache-gomodcache 833032839 B /tmp/gomodcache
go-modcache-gocache absent /tmp/go-cache
go-modcache-gomod2 absent /tmp/go-modcache
go-modcache-go absent /tmp/go
go-modcache-gm2 absent /tmp/gm2
gopath-tmp 703126195 B /tmp/gopath
gopath-root 1324031577 B /root/go
go-build-root 169612233 B /root/.cache/go-build
pip-cache 13660700 B /root/.cache/pip
apt-archives 325071204 B /var/cache/apt/archives
loop-scratch unmeasured (timeout) /tmp/opencode
reclaimable total: 9858490264 B across 13 paths (1 unmeasured)
BREACH: / at 96.7% >= 91%
num good exit=3
usage: disk-show [-h] [--format {json,human}] [--threshold PCT] [--mount PATH]
disk-show: error: argument --threshold: expected one argument
num missing exit=2
usage: disk-show [-h] [--format {json,human}] [--threshold PCT] [--mount PATH]
disk-show: error: unrecognized arguments: --nope
unknown exit=2
> build · mimo-v2.6-flash-free
[0m$ [0mcd /tmp/opencode/replay73 && bash tests/test_registry_coverage.sh > /tmp/opencode/prefix73.log 2>&1; echo "exit=$?"; tail -3 /tmp/opencode/prefix73.log; echo "=== FAILS ==="; grep "^FAIL:" /tmp/opencode/prefix73.log
Command moved to the background (shell ID: sh_0f17503f2001eRkHsFVQ1xtJhr).
Output is streaming to: /root/.local/share/opencode/shell/fa3e85b2145a60c127b5c9261e76a7ba6d520299/sh_0f17503f2001eRkHsFVQ1xtJhr.out
> build · mimo-v2.6-flash-free
[0m$ [0mcd /data/repo && grep -n "^# --- C[0-9]" tests/test_registry_coverage.sh
985:# --- C1 an unregistered tool ------------------------------------------------
1003:# --- C2 a registered tool whose section was deleted -------------------------
1023:# --- C3 a section left behind by a file that no longer exists ---------------
1036:# --- C4 a registered suite section whose file was renamed -------------------
1050:# --- C5/C6/C7 one missing field each: Usage, Purpose, Exit codes ------------
1082:# --- C8 a tool whose --help exits non-zero ----------------------------------
1106:# --- C9 a tool whose --help exits 0 but says nothing ------------------------
1125:# --- C10 a registry file that is not there ---------------------------------
1132:# --- C11 a tools directory that is not there -------------------------------
1139:# --- C12 non-vacuity: a tools dir that enumerates to nothing ---------------
1149:# --- C13 non-vacuity: a registry with no sections --------------------------
1159:# --- C14 a tool that swallows an unknown argument (the behaviour half) -------
1187:# --- C15 a table that stops promising exit 2 (the documented half) -----------
1228:# --- C16 a live figure that no longer matches what the tool discovers --------
1267:# --- C17 a figure with no date anywhere on its line --------------------------
1282:# --- C18 no live figure at all ----------------------------------------------
1310:# --- C19 a SECOND live figure: two copies of one truth -----------------------
1331:# --- C20 a live line that no longer carries any figure -----------------------
1364:# --- C21 a tool that DEFINES --format and then ignores its value — the exact
1402:# --- C22 the SCOPE side: a table that starts naming `--timeout 0` pulls its
1435:# --- C23 the PORT class, (69): a tool that advertises `--port PORT` and
1439:# --- C21 planted ONE class so the sibling probe could be proved silent;
1440:# --- C23 plants BOTH, because the two port probes are separate subjects and
1501:# --- C24 the (72) class: a value-taking flag whose MISSING value is swallowed.
1559:# --- C25 the (75) class: a value-taking flag whose OPTION LINE is written so
1626:# --- C26 the (71) reader: a promise written in the TABLE'S OWN WORDS. C22
1671:# --- C27 the (76) class: the SAME defect C25 plants, in the ONE writing C25's
1744:# --- C28 a tool whose `usage:` row names none of its own flags ----------------
1816:# --- C29 the (73) class: two metavars whose own TYPE says the value is wrong.
> build · mimo-v2.6-flash-free
[0m$ [0mcd /data/repo && grep -rn "213/213\|213 assertions\|213/0" --include='*.md' . | grep -v agent-logs/identity | head -20; echo "=== 28 controls refs ==="; grep -rn "28 negative controls\|28 controls" --include='*.md' . | head
grep: ./agent-logs/identity-mia.md: binary file matches
./CHANGELOG.md:4893:## [0.4.125] - 2026-09-29 — reconcile: the live suite figure was one suite behind (**59 → 60**) after another identity's `tests/test_reduced_motion.php` landed mid-run, which is what turned `tests/test_registry_coverage.sh` red **26** ways on a tree where nothing else was wrong — `- Live (measured …)` refreshed, coverage **187/26 → 213/0**
./tools/REGISTRY.md:3212:- `bash tests/test_registry_coverage.sh` → **213 assertions**, ~153s, no network:
./tools/REGISTRY.md:3360:**Status**: Built ✅ 2026-09-28 (green **213/213** on 2026-09-29; `[0.4.114]` added section **E** +
./agent-logs/PROGRESS.md:6342:- **Next-candidate queued, not actioned**: carry items (2), (4)–(8), (14), (15), (17), (18), (20), (22), (23), (25), (28), (32), (36), (39), (42), (44), (47), (48), (52), (53), (54), (56), (60), (61), (62), (66), (67), (68), (70), (73), (74), (78) from the 04:35Z entry unchanged — item **(77) struck — EXECUTED by `[0.4.123]`**: the `usage:` row was the one row no assertion opened, and all three of its shapes were reported as covered — measured first at **16 of 19** tools honouring it (scope = an `^options:` section, 19 of 20, `pdns-api.py` out by that line), repaired in three help bodies (`verify-landing` `[OPTIONS]`, `ip-drift-cron` and `go-compile-drift-verify` with the synopsis on the next row), reader **inside `run_check()`** with `VIOLATION synopsis_flags` / `ERROR synopsis_no_scope` / `syn_n` + `syn_ok`, control **C28** (27 → 28), four other controls' heredoc rows rewritten so each still plants exactly one defect, live **213/0** with child **19/19/0**, replays **19/16/3** and **184/29 = 213**. **New from this run: (79)** — *the pair-level synopsis promise: the labelled row names at least the option-list pairs* — measured at **31 of 58** pairs before this run's repairs and **33 of 58** after, short across **11** tools (`regression-run` 2/8, `immich-roundtrip` 2/7, `tls-check` 2/5, `inbox-status` 3/5, `dns-verify` 2/3, `ip-drift-check` 2/4, `smtp-relay-probe` 2/3, `domain-availability-check` 1/2, `repo-lint` 3/4, `verify-landing` 1/2, `go-compile-drift-verify` 1/3), so it would rewrite 11 help bodies and must be its own step. **(73)** (the value half of a metavar), **(74)** (a bound covers the direct child only) and **(78)** (a partial run can land red on `main`) are the live head of the list, and the older carried items stand as written.
./agent-logs/PROGRESS.md:6386:## 2026-09-29T07:41Z main-loop run (continuation, after an environment outage) — STEP 0 re-read FIRST (0 unread both DBs; status reply **dev 120 / prod 86**), **(74) confirmed DONE** on its own push, then the post-push **28 reds attributed to one cause** — the `- Live:` suite figure was a suite behind (59 → 60) — fixed and measured: coverage **187/26 → 213/0**, post-push **all suites green (60 / 5361 / 0)**, `[0.4.125]`
./agent-logs/PROGRESS.md:6392:- **Why the figure was behind, and the fix**: `tests/test_reduced_motion.php` was created and committed by **another identity** (`d098d9f`, mid-run, after `[0.4.124]` was already pushed), so `regression-run --list` answered **60** while `tools/REGISTRY.md`'s `- Live (measured 2026-09-28)` still said **59** — the line's own rule doing exactly what it says (*"adding a suite to `tests/` turns it red until this line is refreshed"*). Refreshed to **`- Live (measured 2026-09-29): … 60 suites`**, and the two other places that repeat the count as if it were current — `REGISTRY`'s `fresh()` rationale prose ("the live tree answers 59") and the matching comment above `fresh()` in `tests/test_registry_coverage.sh` — moved to **60** as well, so the file cannot contradict itself. The candidate that had been left open for exactly this (**queue it and leave `main` red**) was **fixed instead of queued**, with before/after measured: coverage **187/26 → 213/0**, and **187 + 26 = 213**, so every red came back green and nothing else moved; the comment-only edit then re-read **213 / 0** again, i.e. no assertion count moved.
./agent-logs/PROGRESS.md:6529: surfaces were green: `test_regression_run.sh 307/0`, `test_registry_coverage.sh 213/0`,
./agent-logs/PROGRESS.md:6892:- **Regression (authoritative), run after the promote on the working tree**: `./tools/regression-run --format json` → **67 suites, 5863 passed, 2 failed, 0 skipped, exit 1**. The two reds are `tests/test_gladex_monitor.sh` **A3** (`git status --short --branch` must equal `## main...origin/main`) and **A15** (`git-tree` must print `[OK] clean`) — i.e. **this run's own commit `e6e2ef0` not yet pushed plus the reviewer's verdict file still untracked**, the same two-assertion shape every pre-push run reports, not a product defect; re-run to green is the closing measurement below. **Every other suite is green, including all four this step touched**: `test_team_page` **11/0**, `test_team_page_privacy` **39/0**, `test_vhost_ui_smoke` **85/0**, `test_webmail_session_routing` **79/0**, plus `test_registry_coverage` **213/0**, `test_repo_lint` **420/0**, `test_queue_source` **181/0**, `test_regression_run` **314/0**, `test_main_landmark` **480/0**. **6854 assertion arithmetic**: 5863 + 2 = 5865 counted, up from the previous run's 5854 because `test_team_page` gained 3, `test_team_page_privacy` gained 4, and `test_vhost_ui_smoke` gained 1 — **+8 from this step**, 5854 + 8 = 5862, with the remaining +1 being `test_main_landmark`'s post-promote byte-identity clearing (479 → 480).
./agent-logs/PROGRESS.md:6988:- **Suites re-run after the correction**: `test_app_version` **39/0**, `test_cli_version` **35/0**, `test_changelog_api` **86/0**, `test_changelog_mobile` **125/0**, `test_investor_heading` **53/0**, `test_registry_coverage` **213/0**, `queue-source-check` → **exit 0, "[0.4.138] pointer-only, 111 item line(s) frozen across 95 section(s), 96 PROGRESS bullet(s)"**, `repo-lint` → **143 entries / 143 unique** with its only 2 failures belonging to another run (below).
./agent-logs/PROGRESS.md:7001:- **What the fix is, and why I did not do it**: someone has to write the `0.4.139` heading — but three identities cited it and only one can own the entry, so whoever appends it decides whose work the token means, and appending a heading just to silence a linter would both misattribute their citations and set up a duplicate-`##` failure the moment the owning run writes its own. Writing another identity's heading is the unilateral act this loop's rules exist to prevent, exactly as (97)'s redaction is. **Owner: the runs that cited it.** Everything this run touched is green: `queue-source-check` exit 0, `repo-lint` clean on every file I wrote, `test_app_version` 39/0, `test_cli_version` 35/0, `test_changelog_api` 86/0, `test_changelog_mobile` 125/0, `test_investor_heading` 53/0, `test_registry_coverage` 213/0, `/changelog` 200 on both envs with the note rendered, `inbox-status` exit 0 with **0 unread / 0 open**, spend **0.00**.
./agent-logs/PROGRESS.md:7023:- **Regression (authoritative, on the pushed tree)**: `./tools/regression-run --format json` → **70 suites / 6,151 passed / 0 failed / 0 skipped, `ok: true`, exit 0** — the first fully green full run in the last several entries, whose recorded reds were all attributed elsewhere. It covers `test_system_status_go_compile` **109/0**, `test_gladex_monitor` **27/0** (A9/A10/A11 = repo-lint exit code, parse-clean, `0 missing`), `test_ts_ordering` **13/0** (both live DBs **0 non-epoch rows**), `test_registry_coverage` **213/0**, `test_repo_lint` **420/0**, `test_queue_source` **181/0**.
=== 28 controls refs ===
> build · mimo-v2.6-flash-free
[0m← [0mEdit repo/tools/REGISTRY.md
Index: repo/tools/REGISTRY.md
===================================================================
--- repo/tools/REGISTRY.md
+++ repo/tools/REGISTRY.md
@@ -3208,9 +3208,9 @@
`REGISTRY_COVERAGE_CHILD` is internal (the re-exec branch). Defaults resolve from
the suite's own path, so a copy run from `/tmp` still reads the real tree.
**Tests**:
-- `bash tests/test_registry_coverage.sh` → **213 assertions**, ~153s, no network:
+- `bash tests/test_registry_coverage.sh` → **234 assertions**, ~170s, no network:
**A** the live tree is fully covered (exit 0, zero violations, no `ERROR`),
**B** seven cross-checks against an independent recount (tools, sections, tool
sections, `--help` probed, `--help` answered, two floors), **C** 28 negative
controls — unregistered tool, deleted section, stale tool heading, stale suite
> build · mimo-v2.6-flash-free
[0m← [0mEdit repo/tools/REGISTRY.md
Index: repo/tools/REGISTRY.md
===================================================================
--- repo/tools/REGISTRY.md
+++ repo/tools/REGISTRY.md
@@ -3211,9 +3211,9 @@
**Tests**:
- `bash tests/test_registry_coverage.sh` → **234 assertions**, ~170s, no network:
**A** the live tree is fully covered (exit 0, zero violations, no `ERROR`),
**B** seven cross-checks against an independent recount (tools, sections, tool
- sections, `--help` probed, `--help` answered, two floors), **C** 28 negative
+ sections, `--help` probed, `--help` answered, two floors), **C** 29 negative
controls — unregistered tool, deleted section, stale tool heading, stale suite
heading, one missing field each of Usage/Purpose/exit codes, `--help` exiting
non-zero, `--help` silent, missing registry, missing tools dir, empty tools
dir, sectionless registry, a tool that swallows an unknown flag (**C14**),
> build · mimo-v2.6-flash-free
[0m$ [0mcd /data/repo && grep -n "syn_ok\` exactly one below it" tools/REGISTRY.md; grep -n "exactly one below it" tools/REGISTRY.md
(no output)
> build · mimo-v2.6-flash-free
[0m$ [0mcd /data/repo && grep -n "one below it" tools/REGISTRY.md
3349: one below it. **Pre-fix replay of (77)** over `/tmp/opencode/pre77` — a copy
> build · mimo-v2.6-flash-free
[0m→ [0mRead repo/tools/REGISTRY.md [90m[limit=22, offset=3343][0m
> build · mimo-v2.6-flash-free
[0m→ [0mRead /root/.local/share/opencode/shell/fa3e85b2145a60c127b5c9261e76a7ba6d520299/sh_0f17503f2001eRkHsFVQ1xtJhr.out
> build · mimo-v2.6-flash-free
[0m← [0mEdit repo/tools/REGISTRY.md
Index: repo/tools/REGISTRY.md
===================================================================
--- repo/tools/REGISTRY.md
+++ repo/tools/REGISTRY.md
@@ -3371,9 +3371,12 @@
scope to the table's own exit-2 bullet + control **C26** (182 → 190), queue
item (76) dropped that reader's description-column requirement + control
**C27** (190 → 201), queue item (77) gave the tool's own `usage:` row a
reader — **G20**–**G23** + control **C28** — and repaired the three `--help`
-bodies it caught (201 → **213**) — a documented exit 2
+bodies it caught (201 → 213), and queue item **(73)** `[0.4.140]` read the
+metavar's own **type** — two more derived classes, enum and quantity, as
+**G24**–**G30** + control **C29**, with the 61-pair scope partitioned and
+asserted rather than assumed (213 → **234**) — a documented exit 2
is now probed for a bad *value*, and the codes this suite cannot reach are
declared rather than implied)
## test_detached_children.sh
> build · mimo-v2.6-flash-free
[0m$ [0mcd /data/repo && grep -rn "negative controls\|Tests\*\*:" tests/*.sh tests/*.php 2>/dev/null | head
tests/test_registry_coverage.sh:831: C 28 negative controls: each plant is proved to have taken effect first,
tests/test_registry_coverage.sh:979:# C — negative controls.
tests/test_system_status_go_compile.sh:724:# --- negative controls: each plant must BREAK a comparison above, otherwise the
tests/test_system_status_go_tests.sh:609:# --- negative controls: each plant must BREAK a comparison above, otherwise the
tests/test_system_status_promote_gates.sh:2235:# --- negative controls: each plant must BREAK a comparison above, otherwise the
> build · mimo-v2.6-flash-free
[0m→ [0mRead repo/tests/test_registry_coverage.sh [90m[limit=45, offset=812][0m
> build · mimo-v2.6-flash-free
[0m✗ [0mEdit repo/tests/test_registry_coverage.sh failed
[91m[1mError: [0mCould not find oldString in /data/repo/tests/test_registry_coverage.sh. It must match exactly, including whitespace and indentation.
> build · mimo-v2.6-flash-free
Replay: **200 passed / 34 failed** (= 234). Now the strongest control — the *old* suite over the same planted tree:
[0m$ [0mcd /data/repo && rm -rf /tmp/opencode/replay73old && cp -a /tmp/opencode/replay73 /tmp/opencode/replay73old && git show HEAD:tests/test_registry_coverage.sh > /tmp/opencode/replay73old/tests/test_registry_coverage.sh && cd /tmp/opencode/replay73old && bash tests/test_registry_coverage.sh > /tmp/opencode/oldsuite73.log 2>&1; echo "exit=$?"; tail -3 /tmp/opencode/oldsuite73.log; grep -c "^FAIL:" /tmp/opencode/oldsuite73.log; md5sum /tmp/opencode/replay73old/tests/test_registry_coverage.sh; cd /data/repo && git show HEAD:tests/test_registry_coverage.sh | md5sum
Command moved to the background (shell ID: sh_0f17894e9001l9uw10tm8AWTt1).
Output is streaming to: /root/.local/share/opencode/shell/fa3e85b2145a60c127b5c9261e76a7ba6d520299/sh_0f17894e9001l9uw10tm8AWTt1.out
Select another run log from the list above. Only files matching run-YYYYMMDD-HHMMSS-N.log are readable.
App log tail — prod-8001.log (last 60 lines)
[Wed Sep 30 10:34:20 2026] 127.0.0.1:59706 Accepted [Wed Sep 30 10:34:20 2026] 127.0.0.1:59706 Closing [Wed Sep 30 10:34:21 2026] 127.0.0.1:59720 Accepted [Wed Sep 30 10:34:21 2026] 127.0.0.1:59720 Closing [Wed Sep 30 10:34:21 2026] 127.0.0.1:59724 Accepted [Wed Sep 30 10:34:21 2026] 127.0.0.1:59724 Closing [Wed Sep 30 10:34:22 2026] 127.0.0.1:59738 Accepted [Wed Sep 30 10:34:22 2026] 127.0.0.1:59738 Closing [Wed Sep 30 10:34:23 2026] 127.0.0.1:59752 Accepted [Wed Sep 30 10:34:23 2026] 127.0.0.1:59752 Closing [Wed Sep 30 10:34:24 2026] 127.0.0.1:59754 Accepted [Wed Sep 30 10:34:24 2026] 127.0.0.1:59754 Closing [Wed Sep 30 10:34:24 2026] 127.0.0.1:59768 Accepted [Wed Sep 30 10:34:24 2026] 127.0.0.1:59768 Closing [Wed Sep 30 10:34:25 2026] 127.0.0.1:35010 Accepted [Wed Sep 30 10:34:25 2026] 127.0.0.1:35010 Closing [Wed Sep 30 10:34:25 2026] 127.0.0.1:35018 Accepted [Wed Sep 30 10:34:25 2026] 127.0.0.1:35018 Closing [Wed Sep 30 10:34:26 2026] 127.0.0.1:35026 Accepted [Wed Sep 30 10:34:26 2026] 127.0.0.1:35026 Closing [Wed Sep 30 10:34:27 2026] 127.0.0.1:35030 Accepted [Wed Sep 30 10:34:27 2026] 127.0.0.1:35030 Closing [Wed Sep 30 10:34:28 2026] 127.0.0.1:35042 Accepted [Wed Sep 30 10:34:28 2026] 127.0.0.1:35042 Closing [Wed Sep 30 10:34:29 2026] 127.0.0.1:35048 Accepted [Wed Sep 30 10:34:29 2026] 127.0.0.1:35048 Closing [Wed Sep 30 10:34:38 2026] 127.0.0.1:32810 Accepted [Wed Sep 30 10:34:38 2026] 127.0.0.1:32810 Closing [Wed Sep 30 10:34:38 2026] 127.0.0.1:32824 Accepted [Wed Sep 30 10:34:38 2026] 127.0.0.1:32824 Closing [Wed Sep 30 10:34:39 2026] 127.0.0.1:32832 Accepted [Wed Sep 30 10:34:39 2026] 127.0.0.1:32832 Closing [Wed Sep 30 10:34:40 2026] 127.0.0.1:32840 Accepted [Wed Sep 30 10:34:40 2026] 127.0.0.1:32840 Closing [Wed Sep 30 10:34:41 2026] 127.0.0.1:32844 Accepted [Wed Sep 30 10:34:41 2026] 127.0.0.1:32844 Closing [Wed Sep 30 10:34:41 2026] 127.0.0.1:32850 Accepted [Wed Sep 30 10:34:41 2026] 127.0.0.1:32850 Closing [Wed Sep 30 10:34:42 2026] 127.0.0.1:32864 Accepted [Wed Sep 30 10:34:42 2026] 127.0.0.1:32864 Closing [Wed Sep 30 10:34:43 2026] 127.0.0.1:32878 Accepted [Wed Sep 30 10:34:43 2026] 127.0.0.1:32878 Closing [Wed Sep 30 10:34:44 2026] 127.0.0.1:32880 Accepted [Wed Sep 30 10:34:44 2026] 127.0.0.1:32880 Closing [Wed Sep 30 10:34:44 2026] 127.0.0.1:32890 Accepted [Wed Sep 30 10:34:44 2026] 127.0.0.1:32890 Closing [Wed Sep 30 10:38:33 2026] 127.0.0.1:50738 Accepted [Wed Sep 30 10:38:33 2026] 127.0.0.1:50738 Closed without sending a request; it was probably just an unused speculative preconnection [Wed Sep 30 10:38:33 2026] 127.0.0.1:50738 Closing [Wed Sep 30 10:38:34 2026] 127.0.0.1:50752 Accepted [Wed Sep 30 10:38:34 2026] 127.0.0.1:50752 Closed without sending a request; it was probably just an unused speculative preconnection [Wed Sep 30 10:38:34 2026] 127.0.0.1:50752 Closing [Wed Sep 30 10:39:04 2026] 127.0.0.1:45494 Accepted [Wed Sep 30 10:39:04 2026] 127.0.0.1:45494 Closed without sending a request; it was probably just an unused speculative preconnection [Wed Sep 30 10:39:04 2026] 127.0.0.1:45494 Closing [Wed Sep 30 10:39:06 2026] 127.0.0.1:34554 Accepted [Wed Sep 30 10:39:06 2026] 127.0.0.1:34554 Closed without sending a request; it was probably just an unused speculative preconnection [Wed Sep 30 10:39:06 2026] 127.0.0.1:34554 Closing [Wed Sep 30 10:40:29 2026] 127.0.0.1:48826 Accepted
Generated 2026-09-30 08:40:29 UTC · Gladex.de