Gladex Agent Logs

Agent run logs & app logs · env: prod · LAN-only investor surface

Overview
Run logs523 files, 17.3 MB
Latest run logrun-20260926-024118-121.log
Log directory/data/agent-logs
App log directory/opt/startup/prod/logs
Run logs (newest first, last 50)
FileSizeModified (UTC)
run-20260926-024118-121.log 149 KB 2026-09-26 01:08:42
run-20260926-020038-120.log 273 KB 2026-09-26 00:31:18
run-20260926-015037-119.log 153 B 2026-09-25 23:50:38
run-20260926-014036-118.log 153 B 2026-09-25 23:40:37
run-20260926-013035-117.log 153 B 2026-09-25 23:30:36
run-20260926-012035-116.log 153 B 2026-09-25 23:20:35
run-20260926-011034-115.log 153 B 2026-09-25 23:10:35
run-20260926-010033-114.log 153 B 2026-09-25 23:00:34
run-20260926-005033-113.log 190 B 2026-09-25 22:50:33
run-20260926-004031-112.log 153 B 2026-09-25 22:40:33
run-20260926-003030-111.log 153 B 2026-09-25 22:30:31
run-20260926-002029-110.log 153 B 2026-09-25 22:20:30
run-20260926-001029-109.log 153 B 2026-09-25 22:10:29
run-20260926-000025-108.log 190 B 2026-09-25 22:00:29
run-20260925-235025-107.log 153 B 2026-09-25 21:50:25
run-20260925-234024-106.log 153 B 2026-09-25 21:40:25
run-20260925-233023-105.log 153 B 2026-09-25 21:30:24
run-20260925-232022-104.log 153 B 2026-09-25 21:20:23
run-20260925-231021-103.log 153 B 2026-09-25 21:10:22
run-20260925-230021-102.log 153 B 2026-09-25 21:00:21
run-20260925-225020-101.log 190 B 2026-09-25 20:50:21
run-20260925-224019-100.log 153 B 2026-09-25 20:40:19
run-20260925-223018-99.log 152 B 2026-09-25 20:30:19
run-20260925-222017-98.log 152 B 2026-09-25 20:20:18
run-20260925-221016-97.log 152 B 2026-09-25 20:10:17
run-20260925-220015-96.log 152 B 2026-09-25 20:00:16
run-20260925-213653-95.log 141 KB 2026-09-25 19:50:15
run-20260925-205157-94.log 389 KB 2026-09-25 19:26:53
run-20260925-195858-93.log 517 KB 2026-09-25 18:41:57
run-20260925-192850-92.log 321 KB 2026-09-25 17:48:58
run-20260925-185030-91.log 325 KB 2026-09-25 17:18:50
run-20260925-180536-90.log 232 KB 2026-09-25 16:40:30
run-20260925-173957-89.log 252 KB 2026-09-25 15:55:36
run-20260925-171044-88.log 201 KB 2026-09-25 15:29:57
run-20260925-163300-87.log 247 KB 2026-09-25 15:00:44
run-20260925-160013-86.log 175 KB 2026-09-25 14:23:00
run-20260925-153430-85.log 158 KB 2026-09-25 13:50:13
run-20260925-152430-84.log 152 B 2026-09-25 13:24:30
run-20260925-151428-83.log 189 B 2026-09-25 13:14:30
run-20260925-150428-82.log 152 B 2026-09-25 13:04:28
run-20260925-145427-81.log 152 B 2026-09-25 12:54:28
run-20260925-144426-80.log 152 B 2026-09-25 12:44:27
run-20260925-143426-79.log 152 B 2026-09-25 12:34:26
run-20260925-142425-78.log 189 B 2026-09-25 12:24:26
run-20260925-141424-77.log 152 B 2026-09-25 12:14:25
run-20260925-140424-76.log 152 B 2026-09-25 12:04:24
run-20260925-135423-75.log 152 B 2026-09-25 11:54:24
run-20260925-134422-74.log 152 B 2026-09-25 11:44:23
run-20260925-133422-73.log 152 B 2026-09-25 11:34:22
run-20260925-132421-72.log 152 B 2026-09-25 11:24:22
Tail — run-20260926-024118-121.log (last 200 lines)
section6 skip(): 3 -> 3
meta exit=1
  FAIL: F2: exit code is 1 (got 255) — a broken document must be red, not green and not 255
  FAIL: F2: no PHP fatal — an unparseable token must not abort the suite
  FAIL: F2: the suite reached its own === Results: line (a consumer always gets a verdict)
  FAIL: F2: section 6 reports 12 counted skips — 3 suppressed properties x 4 documents (got 0)
  FAIL: F2: section 6 still FAILS the token once per document (got 1) — skipped is not the same as passed
  FAIL: F2: all four documents were exercised in section 6 (got 1)
  FAIL: F2: 'differs' is reported as SKIP on all four documents (got 0)
  FAIL: F2: 'surface' is reported as SKIP on all four documents (got 0)
  FAIL: F2: 'bg' is reported as SKIP on all four documents (got 0)
=== Results: 39 passed, 9 failed, 0 skipped ===
=== real suite untouched ===
3abb053a73c86dc2397c6329f50e1dab  tests/test_app_contrast.php
=== Results: 185 passed, 0 failed, 0 skipped ===
=== Results: 48 passed, 0 failed, 0 skipped ===
> build · mimo-v2.6-flash-free
Both mutations caught. Now the full regression — let me find the repo's runner:
$ cd /data/repo && ls tools/ && echo "=== runner? ===" && grep -rln 'test_app_contrast\|3155\|run-all\|regression' tools/ tests/*.sh 2>/dev/null | head
REGISTRY.md
__pycache__
budget-show
dns-verify
domain-availability-check
healthcheck
ip-drift-check
ip-drift-cron
pdns-api.py
promote-dev-to-prod
repo-lint
smtp-relay-probe
source-sync-check
system-status
tls-check
verify-landing
version-check
=== runner? ===
tools/source-sync-check
tools/REGISTRY.md
tools/repo-lint
tools/system-status
tools/smtp-relay-probe
tests/test_ip_drift_cron.sh
tests/test_repo_lint.sh
tests/test_smtp_relay_probe.sh
tests/test_source_sync_check.sh
> build · mimo-v2.6-flash-free
$ cd /data/repo && bash tests/test_source_sync_check.sh 2>&1 | tail -6; echo "---"; bash tests/test_ts_ordering.sh 2>/dev/null | tail -3; echo "--- php sample ---"; php tests/test_ts_ordering.php 2>&1 | tail -3
PASS: symlink invocation does not walk up to the link's parent
PASS: symlink invocation really compared the trees

===============================
source-sync-check suite: 30 passed, 0 failed
===============================
---
--- php sample ---
  PASS: epoch values satisfy JS fmtTime numeric branch

=== Results: 7 passed, 0 failed ===
> build · mimo-v2.6-flash-free
← Write /tmp/opencode/contrastfix/regression.sh
Created file successfully: /tmp/opencode/contrastfix/regression.sh
> build · mimo-v2.6-flash-free
$ chmod +x /tmp/opencode/contrastfix/regression.sh && bash /tmp/opencode/contrastfix/regression.sh /tmp/opencode/contrastfix/regression.txt
PHP   tests/test_changelog_api.php  86 passed, 0 failed, 0 skipped (rc=0)
PHP   tests/test_chat_a11y.php  38 passed, 0 failed, 0 skipped (rc=0)
PHP   tests/test_chat_frontend.php  NO-SUMMARY rc=0
PHP   tests/test_cli_version.php  35 passed, 0 failed, 0 skipped (rc=0)
PHP   tests/test_investor_heading.php  53 passed, 0 failed, 0 skipped (rc=0)
PHP   tests/test_ip_drift_safety.php  16 passed, 0 failed, 0 skipped (rc=0)
PHP   tests/test_lan_middleware.php  49 passed, 0 failed, 0 skipped (rc=0)
PHP   tests/test_mailbox_a11y.php  43 passed, 0 failed, 0 skipped (rc=0)
PHP   tests/test_main_landmark.php  331 passed, 0 failed, 0 skipped (rc=0)
PHP   tests/test_page_lang.php  15 passed, 0 failed, 0 skipped (rc=0)
PHP   tests/test_php_busy_timeout.php  NO-SUMMARY rc=0
PHP   tests/test_stats_dbpath.php  16 passed, 0 failed, 0 skipped (rc=0)
PHP   tests/test_stats_gocli_path.php  14 passed, 0 failed, 0 skipped (rc=0)
PHP   tests/test_templates_contrast.php  84 passed, 0 failed, 0 skipped (rc=0)
PHP   tests/test_templates_gallery.php  27 passed, 0 failed, 0 skipped (rc=0)
PHP   tests/test_ts_ordering.php  7 passed, 0 failed, 0 skipped (rc=0)
PHP   tests/test_webmail_session_routing.php  NO-SUMMARY rc=0

SUITES=39 TOTAL_PASSED=1854 TOTAL_FAILED=0 TOTAL_SKIPPED=0
FAILED_SUITES=tests/test_dns_verify.sh(no-summary) tests/test_domain_availability.sh(no-summary) tests/test_identity_wrapper.sh(no-summary) tests/test_ip_drift_check.sh(no-summary) tests/test_ip_drift_cron.sh(no-summary) tests/test_pdns_api.sh(no-summary) tests/test_smtp_relay_probe.sh(no-summary) tests/test_system_status_go_compile.sh(no-summary) tests/test_system_status_go_tests.sh(no-summary) tests/test_system_status_mx_soa.sh(no-summary) tests/test_system_status_promote_gates.sh(no-summary) tests/test_system_status_unread.sh(no-summary) tests/test_tls_check.sh(no-summary) tests/test_chat_frontend.php(no-summary) tests/test_php_busy_timeout.php(no-summary) tests/test_webmail_session_routing.php(no-summary)
> build · mimo-v2.6-flash-free
My runner's parser missed several suites' summary formats (all rc=0). Inspecting:
$ cd /data/repo && for f in tests/test_dns_verify.sh tests/test_tls_check.sh tests/test_system_status_unread.sh tests/test_chat_frontend.php tests/test_php_busy_timeout.php tests/test_webmail_session_routing.php; do echo "### $f"; bash_or_php=bash; case "$f" in *.php) bash_or_php=php;; esac; $bash_or_php "$f" 2>&1 | tail -4; done
### tests/test_dns_verify.sh
  ok   - M2 precondition: type-validation guard occurs exactly once
  ok   - M2 caught: validation-defeated mutant exits 0 instead of 2

=== Results: 40 passed, 0 failed ===
### tests/test_tls_check.sh
  ok   - live smtps :465 exits 0 (LE cert on mail port)
  ok   - smtps serves the gladex.de cert

=== Results: 99 passed, 0 failed ===
### tests/test_system_status_unread.sh
  ok   - git-tree item present -> repo root resolved to a real git repo
  ok   - symlinked tool still reports the investor-messages item

=== Results: 24 passed, 0 failed ===
### tests/test_chat_frontend.php
  PASS: Last 6h filter checkbox is checked by default
  PASS: 3s polling interval intact

11 passed, 0 failed
### tests/test_php_busy_timeout.php
  PASS: recovery write was immediate (3.5ms < 500ms)
  PASS: exactly the holder's + recovery rows committed (got 2)

Results: 19 passed, 0 failed
### tests/test_webmail_session_routing.php
  PASS: list view states the noreply send block
  PASS: list view renders the New message card

75 passed, 0 failed, 0 skipped
> build · mimo-v2.6-flash-free
Formats vary across suites. Rewriting the runner to be format-agnostic and cache each suite's output:
← Write /tmp/opencode/contrastfix/regression.sh
Wrote file successfully: /tmp/opencode/contrastfix/regression.sh
> build · mimo-v2.6-flash-free
← Edit /tmp/opencode/contrastfix/regression.sh
Index: /tmp/opencode/contrastfix/regression.sh
===================================================================
--- /tmp/opencode/contrastfix/regression.sh
+++ /tmp/opencode/contrastfix/regression.sh
@@ -30,9 +30,8 @@
   if [ -z "$line" ]; then
     echo "$n  NO-SUMMARY rc=$rc" >> "$dir/summary.txt"
     BAD+=("$n(no-summary,rc=$rc)"); NS=$((NS+1)); continue
   fi
-  p=$(sed -E 's/.*[^0-9]([0-9]+) passed, [0-9]+ failed.*/\1/;t;x' <<<"$line" 2>/dev/null)
   p=$(grep -oE '[0-9]+ passed' <<<"$line" | head -1 | grep -oE '[0-9]+')
   fl=$(grep -oE '[0-9]+ failed' <<<"$line" | head -1 | grep -oE '[0-9]+')
   sk=$(grep -oE '[0-9]+ skipped' <<<"$line" | head -1 | grep -oE '[0-9]+')
   sk=${sk:-0}

> build · mimo-v2.6-flash-free
$ bash /tmp/opencode/contrastfix/regression.sh /tmp/opencode/contrastfix/suites
test_budget_show.sh  49 passed, 0 failed, 0 skipped (rc=0)
test_dns_verify.sh  40 passed, 0 failed, 0 skipped (rc=0)
test_domain_availability.sh  140 passed, 0 failed, 0 skipped (rc=0)
test_identity_wrapper.sh  28 passed, 0 failed, 0 skipped (rc=0)
test_ip_drift_check.sh  133 passed, 0 failed, 0 skipped (rc=0)
test_ip_drift_cron.sh  93 passed, 0 failed, 0 skipped (rc=0)
test_pdns_api.sh  175 passed, 0 failed, 0 skipped (rc=0)
test_promote_gate.sh  80 passed, 0 failed, 0 skipped (rc=0)
test_promote_json.sh  175 passed, 0 failed, 0 skipped (rc=0)
test_promote_lint_gate.sh  143 passed, 0 failed, 0 skipped (rc=0)
test_repo_lint.sh  291 passed, 0 failed, 0 skipped (rc=0)
test_smtp_relay_probe.sh  38 passed, 0 failed, 0 skipped (rc=0)
test_source_sync_check.sh  30 passed, 0 failed, 0 skipped (rc=0)
test_system_status_go_compile.sh  82 passed, 0 failed, 0 skipped (rc=0)
test_system_status_go_tests.sh  66 passed, 0 failed, 0 skipped (rc=0)
test_system_status_mx_soa.sh  31 passed, 0 failed, 0 skipped (rc=0)
test_system_status_promote_gates.sh  295 passed, 0 failed, 0 skipped (rc=0)
test_system_status_unread.sh  24 passed, 0 failed, 0 skipped (rc=0)
test_tls_check.sh  99 passed, 0 failed, 0 skipped (rc=0)
test_app_contrast.php  185 passed, 0 failed, 0 skipped (rc=0)
test_app_contrast_meta.php  48 passed, 0 failed, 0 skipped (rc=0)
test_app_version.php  39 passed, 0 failed, 0 skipped (rc=0)
test_changelog_api.php  86 passed, 0 failed, 0 skipped (rc=0)
test_chat_a11y.php  38 passed, 0 failed, 0 skipped (rc=0)
test_chat_frontend.php  11 passed, 0 failed, 0 skipped (rc=0)
test_cli_version.php  35 passed, 0 failed, 0 skipped (rc=0)
test_investor_heading.php  53 passed, 0 failed, 0 skipped (rc=0)
test_ip_drift_safety.php  16 passed, 0 failed, 0 skipped (rc=0)
test_lan_middleware.php  49 passed, 0 failed, 0 skipped (rc=0)
test_mailbox_a11y.php  43 passed, 0 failed, 0 skipped (rc=0)
test_main_landmark.php  331 passed, 0 failed, 0 skipped (rc=0)
test_page_lang.php  15 passed, 0 failed, 0 skipped (rc=0)
test_php_busy_timeout.php  19 passed, 0 failed, 0 skipped (rc=0)
test_stats_dbpath.php  16 passed, 0 failed, 0 skipped (rc=0)
test_stats_gocli_path.php  14 passed, 0 failed, 0 skipped (rc=0)
test_templates_contrast.php  84 passed, 0 failed, 0 skipped (rc=0)
test_templates_gallery.php  27 passed, 0 failed, 0 skipped (rc=0)
test_ts_ordering.php  7 passed, 0 failed, 0 skipped (rc=0)
test_webmail_session_routing.php  75 passed, 0 failed, 0 skipped (rc=0)

SUITES=39 TOTAL_PASSED=3203 TOTAL_FAILED=0 TOTAL_SKIPPED=0
BAD=none
> build · mimo-v2.6-flash-free
**Full regression: 39 suites, 3203 assertions, 0 failed, 0 skipped.** Movement closes exactly: 3155 + 48 (new meta-suite) = 3203; shell 2012 unchanged; `test_app_contrast.php` stays 185 by design. Now the docs:
$ cd /data/repo && grep -n 'changelog_version' tools/REGISTRY.md | head -20; echo "=== REGISTRY mentions of contrast/PHP suites ==="; grep -n 'test_app_contrast\|test_templates_contrast\|PHP suites' tools/REGISTRY.md | head; echo "=== CHANGELOG tail headings ==="; grep -n '^## \[' CHANGELOG.md | tail -5; echo "=== queue item (1) of 0.4.63 ==="; grep -n 'Next-candidate queued' CHANGELOG.md | tail -2
1904:**JSON**: the top-level key set is pinned by the suite — `tool, timestamp, repo_root, requested_sha, sha_resolved, error, files_total, linted, skipped, failures, errors, go_compile, changelog_version, ok, exit_code` (`rc == exit_code`). `go_compile` = `{attempted, go_mod, files, ok, reason, summary, duration_s}` with `reason` ∈ `no_go_module | no_go_files | go_tool_failed` (null on success); `changelog_version` = `{attempted, path, entries, unique, unparseable, duplicates, ok, reason, summary}` with `reason` ∈ `no_changelog | changelog_unreadable` (null when the file was read), `duplicates` an ordered list of the repeated version tokens and `ok` `null` when nothing was checked; `die()` emits `go_compile: null` **and** `changelog_version: null` so both keys are always present. **`[0.4.61]` closed the one open exception**: the import-time epilog refusal used to emit nothing under `--format json` (stderr only, exit 3) — empty stdin for a `| jq` consumer — and now routes through `die()`, so **every** refusal and every cannot-verify path yields the same 15-key object with `ok false`. **`[0.4.62]` closed the last one**: a usage error was the sole remaining path with no object (`--format json --timeout abc` → exit 2, usage on stderr, **empty stdout**, so a consumer met *jq's* parse error instead of our diagnosis), and it now routes through `die()` too, with **`exit_code: 2`** — the number is what keeps "you typed a bad flag" distinct from "this could not be verified" (3), so a consumer never retries a typo. **Every `--format json` run now yields exactly one 15-key object**, whatever went wrong: verdict (0/1), refusal or environment failure (3), bad argv (2); suite S6 pins the key set of the usage object against a normal run's byte for byte. The format that decides the channel is read by **argparse** from a parser carrying *only* `--format` (`_format_of`), so the read survives the very `--timeout` that broke the parse — a full pre-parse would abort first and answer `human` whenever the failing token came first (S9). Where **no** format can be read at all — an invalid choice, a bare `--format`, anything after `--` — the channel stays human, asserted in S13–S15 rather than assumed; and `--help` still prints argparse's help on stdout with exit 0, a success path where `error()` is never called (queued as its own decision).
1915:- `bash tests/test_repo_lint.sh` → **291 assertions**, hermetic (throwaway git repos under `${TMPDIR:-/tmp}/opencode`, trap-cleaned): clean→0 with exact per-language/skip counts (`files_total = linted + skipped`), all five languages caught with path+line, the 219fd8f incident replayed **both directions** (bad worktree/clean commit → 0; clean worktree/bad commit → 1), arg/env exit contracts, exact JSON key set (now including `changelog_version`), symlink invocation (sandbox + real `/data/tools`), missing-binary→3 and hung-linter→3, read-only status proof on the live repo — plus **section R**, the epilog refusal and its machine-readable form, and **section S**, the usage error's.
1920:- **Section R — the epilog REFUSES to build a label over nothing** (`[0.4.60]`, widened by `[0.4.61]`): derivation made the epilog correct, but `docstring_section` still returned `""` for a heading it could not find and `"\n\n".join` does not complain about `""`, so a renamed or deleted docstring heading produced `env:` printed above a blank line with `--help` exiting **0** — and only Q-render's non-empty requirement stood in the way, i.e. a defect that was *tested* rather than *prevented*, covering only the heading someone named. **R1–R3** are guards on the healthy tool (exit 0, no refusal on stderr, all seven labels rendering a non-empty body); **R4–R9** cover a heading **renamed away** while the tuple still names it (refuse with exit 3; name the pair `'env:' -> 'Environment:'`; nothing on stdout; name **only** the broken pair), and R9 points `GLADEX_REPO_DIR` at the real sandbox repo for the same reason it always did — run from `$SB` the mutant's default repo is not a git repo and it exited 3 for *that* reason, a false pass the red had to be read to catch. **R10–R12b** cover a heading that **exists but whose block is empty** — `docstring_section` stops at the first blank line, so "found" must not mean "fine". **R9's original assertion was written inverted and is corrected in `[0.4.61]`**: it required *no* parseable JSON from the refusing tool — which is exactly the defect (`| jq` meeting empty stdin), so it passed for it. It now asserts the contract, and the block grew accordingly: **R9b** one object on stdout with `ok false`/`exit 3`; **R9c** it names the broken pair; **R9d** it is an ERROR not a verdict (`failures`/`errors` empty, `sha_resolved` null); **R9e** `go_compile`/`changelog_version` null (die()'s shape); **R9f** stderr clean in json mode; **R9g** its **key set is byte-equal to a normal run's** — the shape-level proof that the refusal is the contract and not an exception to it.
1924:- Live: HEAD → exit 0 (173 files, 45 module files compile clean in ~1.6s) with `changelog_version` = `attempted true, entries 68, unique 68, unparseable 0, duplicates [], ok true` (**67 → 68 with `[0.4.63]`**: the count is read from the COMMITTED blob, so it is re-read after the append commits rather than carried over — it read 67 while `[0.4.63]` was still uncommitted, which is the whole point of re-reading; the working-tree count was verified the anchored way, `grep -c '^## \['` → 68 with `uniq -d` empty, because the greedy `sed 's/.*\[\([^]]*\)\].*/\1/'` form reports **5 phantom duplicates** on this tree — 0.4.31/0.4.40/0.4.44/0.4.49/0.4.62 — by taking the last bracket in a heading that cites other versions. The **file** count is 173, not the 171 drafted mid-run: `[0.4.63]`'s own two mailbox files were untracked when that number was written and tracked once it committed, so 171 → 173 is this entry's own movement rather than a count carried); `--sha 219fd8f` → exit 1 naming `tests/test_mailbox_a11y.php:208 [php]`; `--sha 395b9b5` → exit 1 naming `.../status_test.go:5 [go-compile]`; unknown rev / non-repo → exit 3; `--sha probe-r9` → exit 3 with `requested_sha: probe-r9` (the R16 parity reference, live); `--format yaml` → exit 2 with **usage on stderr and an empty stdout** (no format could be read, so none is invented — `[0.4.62]`); **`--format json` + a bad argv → exit 2 with a 384-byte 15-key object on stdout and 0 bytes on stderr** (`--timeout abc`, `--nonsense`, `--timeout 0`, empty `--sha`, and the failing token placed *before* `--format`), while the same argv in human mode still gives argparse's `usage:`+`error:` with **stdout 0 bytes**; `--help` (**106 lines**, was 57 before the epilog stopped carrying its own prose, 102 before the exit-3 clause widened, 103 through `[0.4.61]`, **+3 for `[0.4.62]`'s widened exit-2 clause**) renders all seven docstring blocks verbatim under their labels; a copy with a heading renamed → `repo-lint: ERROR refusing to run - docstring section missing or empty …` + `  'env:' -> 'Environment:'` → **exit 3**, stderr only, and under `--format json` the **same refusal as an object** — `ok false`, `exit_code 3`, `error` naming the pair, **stderr 0 bytes** — which is the `| jq` consumer `[0.4.60]`'s queue described, now parsing (`--format=json` → 3; `--form json` → 3; `-- --format json` → no JSON on stdout; `--format yaml` on the broken copy → refusal only, no `usage:` leak) — **and on that same broken copy `--format json --timeout abc` now yields the 458-byte refusal object with `exit_code 3` instead of falling back to `human`**, which is `[0.4.61]`'s own queue item struck as actioned.
=== REGISTRY mentions of contrast/PHP suites ===
=== CHANGELOG tail headings ===
1514:## [0.4.59] - 2026-09-25 — `repo-lint`'s epilog was still six hand-copied blocks of its own docstring (and its `Usage:` synopsis had already drifted from argparse's generated line): every section is now derived, suite 175 → 198, mutations 11 → 13
1567:## [0.4.60] - 2026-09-25 — `repo-lint`'s derived epilog could still print a label over nothing: `docstring_section` returned `""` for a heading it could not find and nothing in the build treated `""` as wrong, so the refusal now happens at import (exit 3, naming the pair), suite 198 → 218, mutations 13 → 14
1619:## [0.4.61] - 2026-09-25 — `repo-lint`'s import-time refusal was the ONE exit-3 path that emitted no JSON: `--format json | jq` got empty stdin while every other `die()` path emits an object, so the refusal now routes through `die()` with the flags defined ONCE and read by argparse itself before the parser exists (no hand-rolled `sys.argv` scan), suite 218 → 247, mutations 14 → 15
1672:## [0.4.62] - 2026-09-25 — `repo-lint`'s usage errors were the LAST argv that produced no JSON: `--format json --timeout abc` exited 2 with usage prose on stderr and an **empty stdout**, so a `| jq` consumer met jq's own parse error instead of the diagnosis — the format is now read by argparse from a format-only parser and the usage error routes through `die()` with `exit_code 2`, suite 247 → 291, mutations 15 → 16
1730:## [0.4.63] - 2026-09-26 — run 95 committed the `app.php` contrast fix and was cut off by a rate limit before it could run its own new suite or reach prod, so `source-sync-check` sat red on `prod src/php/app.php` for four hours and `[0.4.62]`'s last contrast queue item stayed live: closed this run through the reviewer verdict gate with a real APPROVE (not `--force`), suite 148/25 → 185/0
=== queue item (1) of 0.4.63 ===
> build · mimo-v2.6-flash-free
→ Read repo/CHANGELOG.md [offset=1770, limit=60]

Select another run log from the list above. Only files matching run-YYYYMMDD-HHMMSS-N.log are readable.

App log tail — prod-8001.log (last 60 lines)
[Sat Sep 26 03:02:03 2026] 127.0.0.1:60200 Accepted
[Sat Sep 26 03:02:03 2026] 127.0.0.1:60200 Closing
[Sat Sep 26 03:02:03 2026] 127.0.0.1:60204 Accepted
[Sat Sep 26 03:02:03 2026] 127.0.0.1:60204 Closing
[Sat Sep 26 03:02:03 2026] 127.0.0.1:60206 Accepted
[Sat Sep 26 03:02:03 2026] 127.0.0.1:60206 Closing
[Sat Sep 26 03:02:11 2026] 127.0.0.1:60530 Accepted
[Sat Sep 26 03:02:11 2026] 127.0.0.1:60530 Closing
[Sat Sep 26 03:07:42 2026] 127.0.0.1:34274 Accepted
[Sat Sep 26 03:07:42 2026] 127.0.0.1:34274 Closing
[Sat Sep 26 03:07:42 2026] 127.0.0.1:34286 Accepted
[Sat Sep 26 03:07:42 2026] 127.0.0.1:34286 Closing
[Sat Sep 26 03:07:42 2026] 127.0.0.1:34298 Accepted
[Sat Sep 26 03:07:42 2026] 127.0.0.1:34298 Closing
[Sat Sep 26 03:07:42 2026] 127.0.0.1:34302 Accepted
[Sat Sep 26 03:07:42 2026] 127.0.0.1:34302 Closing
[Sat Sep 26 03:07:44 2026] 127.0.0.1:34312 Accepted
[Sat Sep 26 03:07:44 2026] 127.0.0.1:34312 Closing
[Sat Sep 26 03:07:44 2026] 127.0.0.1:34318 Accepted
[Sat Sep 26 03:07:44 2026] 127.0.0.1:34318 Closing
[Sat Sep 26 03:07:44 2026] 127.0.0.1:34324 Accepted
[Sat Sep 26 03:07:44 2026] 127.0.0.1:34324 Closing
[Sat Sep 26 03:07:44 2026] 127.0.0.1:34328 Accepted
[Sat Sep 26 03:07:44 2026] 127.0.0.1:34328 Closing
[Sat Sep 26 03:07:44 2026] 127.0.0.1:34334 Accepted
[Sat Sep 26 03:07:44 2026] 127.0.0.1:34334 Closing
[Sat Sep 26 03:07:45 2026] 127.0.0.1:56226 Accepted
[Sat Sep 26 03:07:45 2026] 127.0.0.1:56226 Closing
[Sat Sep 26 03:07:46 2026] 127.0.0.1:56242 Accepted
[Sat Sep 26 03:07:46 2026] 127.0.0.1:56242 Closing
[Sat Sep 26 03:07:46 2026] 127.0.0.1:56250 Accepted
[Sat Sep 26 03:07:46 2026] 127.0.0.1:56250 Closing
[Sat Sep 26 03:07:46 2026] 127.0.0.1:56264 Accepted
[Sat Sep 26 03:07:46 2026] 127.0.0.1:56264 Closing
[Sat Sep 26 03:07:46 2026] 127.0.0.1:56278 Accepted
[Sat Sep 26 03:07:46 2026] 127.0.0.1:56278 Closing
[Sat Sep 26 03:07:46 2026] 127.0.0.1:56288 Accepted
[Sat Sep 26 03:07:46 2026] 127.0.0.1:56288 Closing
[Sat Sep 26 03:07:46 2026] 127.0.0.1:56290 Accepted
[Sat Sep 26 03:07:46 2026] 127.0.0.1:56290 Closing
[Sat Sep 26 03:07:46 2026] 127.0.0.1:56306 Accepted
[Sat Sep 26 03:07:46 2026] 127.0.0.1:56306 Closing
[Sat Sep 26 03:07:46 2026] 127.0.0.1:56320 Accepted
[Sat Sep 26 03:07:46 2026] 127.0.0.1:56320 Closing
[Sat Sep 26 03:07:46 2026] 127.0.0.1:56326 Accepted
[Sat Sep 26 03:07:46 2026] 127.0.0.1:56326 Closing
[Sat Sep 26 03:07:46 2026] 127.0.0.1:56328 Accepted
[Sat Sep 26 03:07:46 2026] 127.0.0.1:56328 Closing
[Sat Sep 26 03:07:46 2026] 127.0.0.1:56342 Accepted
[Sat Sep 26 03:07:46 2026] 127.0.0.1:56342 Closing
[Sat Sep 26 03:07:46 2026] 127.0.0.1:56346 Accepted
[Sat Sep 26 03:07:46 2026] 127.0.0.1:56346 Closing
[Sat Sep 26 03:07:46 2026] 127.0.0.1:56358 Accepted
[Sat Sep 26 03:07:46 2026] 127.0.0.1:56358 Closing
[Sat Sep 26 03:07:46 2026] 127.0.0.1:56360 Accepted
[Sat Sep 26 03:07:46 2026] 127.0.0.1:56360 Closing
[Sat Sep 26 03:07:54 2026] 127.0.0.1:56376 Accepted
[Sat Sep 26 03:07:54 2026] 127.0.0.1:56376 Closing
[Sat Sep 26 03:08:46 2026] 127.0.0.1:44062 Accepted

Generated 2026-09-26 01:08:46 UTC · Gladex.de