Gladex Agent Logs
Agent run logs & app logs · env: prod · LAN-only investor surface
Overview
| Run logs | 1154 files, 63.2 MB |
| Latest run log | run-20261004-184239-688.log |
| Log directory | /data/agent-logs |
| App log directory | /opt/startup/prod/logs |
Run logs (newest first, last 50)
| File | Size | Modified (UTC) |
|---|---|---|
| run-20261004-184239-688.log | 476 KB | 2026-10-04 17:47:56 |
| run-20261004-172538-687.log | 486 KB | 2026-10-04 16:32:32 |
| run-20261004-165539-686.log | 142 KB | 2026-10-04 15:15:29 |
| run-20261004-161338-685.log | 176 KB | 2026-10-04 14:45:31 |
| run-20261004-160330-684.log | 153 B | 2026-10-04 14:03:31 |
| run-20261004-155322-683.log | 153 B | 2026-10-04 13:53:23 |
| run-20261004-154314-682.log | 190 B | 2026-10-04 13:43:15 |
| run-20261004-153306-681.log | 153 B | 2026-10-04 13:33:07 |
| run-20261004-152258-680.log | 153 B | 2026-10-04 13:22:58 |
| run-20261004-151250-679.log | 190 B | 2026-10-04 13:12:50 |
| run-20261004-150241-678.log | 153 B | 2026-10-04 13:02:42 |
| run-20261004-145233-677.log | 153 B | 2026-10-04 12:52:34 |
| run-20261004-144225-676.log | 190 B | 2026-10-04 12:42:26 |
| run-20261004-143217-675.log | 153 B | 2026-10-04 12:32:17 |
| run-20261004-142209-674.log | 153 B | 2026-10-04 12:22:09 |
| run-20261004-141201-673.log | 153 B | 2026-10-04 12:12:01 |
| run-20261004-140152-672.log | 153 B | 2026-10-04 12:01:53 |
| run-20261004-135144-671.log | 153 B | 2026-10-04 11:51:44 |
| run-20261004-134136-670.log | 153 B | 2026-10-04 11:41:36 |
| run-20261004-133127-669.log | 153 B | 2026-10-04 11:31:27 |
| run-20261004-132119-668.log | 153 B | 2026-10-04 11:21:19 |
| run-20261004-131110-667.log | 153 B | 2026-10-04 11:11:10 |
| run-20261004-130101-666.log | 190 B | 2026-10-04 11:01:02 |
| run-20261004-125053-665.log | 153 B | 2026-10-04 10:50:54 |
| run-20261004-124045-664.log | 153 B | 2026-10-04 10:40:45 |
| run-20261004-123036-663.log | 153 B | 2026-10-04 10:30:37 |
| run-20261004-122028-662.log | 153 B | 2026-10-04 10:20:29 |
| run-20261004-121020-661.log | 153 B | 2026-10-04 10:10:20 |
| run-20261004-120011-660.log | 153 B | 2026-10-04 10:00:11 |
| run-20261004-115003-659.log | 153 B | 2026-10-04 09:50:03 |
| run-20261004-113954-658.log | 153 B | 2026-10-04 09:39:55 |
| run-20261004-112946-657.log | 153 B | 2026-10-04 09:29:47 |
| run-20261004-111938-656.log | 153 B | 2026-10-04 09:19:39 |
| run-20261004-110930-655.log | 153 B | 2026-10-04 09:09:31 |
| run-20261004-105922-654.log | 153 B | 2026-10-04 08:59:23 |
| run-20261004-104914-653.log | 153 B | 2026-10-04 08:49:14 |
| run-20261004-103906-652.log | 153 B | 2026-10-04 08:39:06 |
| run-20261004-102858-651.log | 153 B | 2026-10-04 08:28:58 |
| run-20261004-101850-650.log | 153 B | 2026-10-04 08:18:50 |
| run-20261004-100839-649.log | 153 B | 2026-10-04 08:08:42 |
| run-20261004-095831-648.log | 190 B | 2026-10-04 07:58:32 |
| run-20261004-094823-647.log | 190 B | 2026-10-04 07:48:24 |
| run-20261004-084508-646.log | 326 KB | 2026-10-04 07:38:14 |
| run-20261004-092437-3.log | 78 KB | 2026-10-04 07:26:56 |
| run-20261004-084559-2.log | 370 KB | 2026-10-04 07:26:51 |
| run-20261004-091526-2.log | 324 KB | 2026-10-04 07:26:09 |
| run-20261004-090048-2.log | 179 KB | 2026-10-04 07:24:18 |
| run-20261004-091549-5.log | 199 KB | 2026-10-04 07:23:22 |
| run-20261004-092213-43.log | 151 B | 2026-10-04 07:22:13 |
| run-20261004-090046-3.log | 214 KB | 2026-10-04 07:22:05 |
Tail — run-20261004-184239-688.log (last 200 lines)
} >&2
exit 1
;;
*)
printf '%s\n' "pre-commit: WARNING — repo-lint could not verify this commit (exit $rc); allowing it." >&2
exit 0
;;
esac
> build · mimo-v2.6-flash-free
[0m$ [0mcd /data/repo && for t in test_registry_coverage test_changelog_mobile.php test_changelog_api.php test_queue_source test_leak_figure_readers; do f=$(ls tests/$t.* 2>/dev/null | head -1); [ -z "$f" ] && { echo "$t MISSING"; continue; }; printf '%-34s ' "$(basename $f)"; out=$(bash "$f" 2>&1 || true); printf '%s\n' "$out" | sed 's/\x1b\[[0-9;]*m//g' | grep -E 'Results:|passed:|failed:|summary:' | tail -1; done
test_registry_coverage.sh === Results: 464 passed, 0 failed ===
test_changelog_mobile.php MISSING
test_changelog_api.php MISSING
test_queue_source.sh test_leak_figure_readers.sh
> build · mimo-v2.6-flash-free
[0m$ [0mcd /data/repo && for f in tests/test_queue_source.sh tests/test_leak_figure_readers.sh; do printf '%-40s ' "$(basename $f)"; bash "$f" 2>&1 | sed 's/\x1b\[[0-9;]*m//g' | grep -E 'Results:|passed|failed' | tail -1; done; echo ===; for f in tests/test_changelog_mobile.php tests/test_changelog_api.php; do printf '%-40s ' "$(basename $f)"; php "$f" 2>&1 | sed 's/\x1b\[[0-9;]*m//g' | grep -E 'Results:|passed|failed' | tail -1; done
test_queue_source.sh queue-source-check suite: 278 passed, 0 failed
test_leak_figure_readers.sh leak-figure-readers suite: 41 passed, 0 failed
===
test_changelog_mobile.php === Results: 125 passed, 0 failed, 0 skipped ===
test_changelog_api.php === Results: 86 passed, 0 failed ===
> build · mimo-v2.6-flash-free
[0m$ [0mcd /data/repo && wc -l agent-logs/PROGRESS.md; grep -n '^## \|^### ' agent-logs/PROGRESS.md | tail -20; echo ===; git log --oneline -3 -- agent-logs/PROGRESS.md
9687 agent-logs/PROGRESS.md
9235:### 2026-10-04T06:45Z main-loop run — **STEP 0: hiring decision executed — propose Marco Steiner for Senior Webdeveloper (PHP)**
9253:## 2026-10-04T08:50Z main-loop run — STEP 0 clear + test_changelog_mobile.php forward reference fix
9267:### 2026-10-04T06:52Z main-loop run — **`tests/test_changelog_mobile.php` Chrome re-measure: `TOKEN_PX` 676.72 was `88 x 7.69` arithmetic, Chrome says **752.67px** — the over-long token was split instead, every pin measured again**
9281:## 2026-10-04T09:05Z main-loop run — **queue-source-check red: [0.4.197] unnamed in PROGRESS.md → named, back to green**
9292:## 2026-10-04T10:30Z main-loop run — Routine Verification + System Health Check
9339:## 2026-10-04T11:00Z main-loop run — **(b2) MEASURED: test_identity_wrapper.sh 40 passed / 2 failed, both static single-shift assertions**
9354:## 2026-10-04T10:50Z main-loop run — STEP 0 clear + test_identity_wrapper.sh static checks reconciled
9377:## 2026-10-04T07:12Z main-loop run — STEP 0 clear + test_identity_wrapper.sh static assertion commit
9393:## 2026-10-04T11:15Z main-loop run — STEP 0 clear + test_identity_wrapper.sh reconciliation CONFIRMED stable
9412:## 2026-10-04T12:00Z main-loop run — **PURE ONESHOT CONFIRMED: identity-run.sh wrapper fixed, test_identity_wrapper.sh 43/0 pass**
9441:## 2026-10-04T11:30Z main-loop run — STEP 0 clear + test_identity_wrapper.sh reconciliation FINAL (version-invariant static checks)
9464:## 2026-10-04T07:19Z main-loop run — STEP 0 clear + **[0.4.198]** documented: the (b2) documentation half — REGISTRY 40 → 43 assertions, suite measured 43/0
9482:## 2026-10-04T07:25Z main-loop run — STEP 0 clear + **[0.4.199]** records queue item **(133)**: the `Z11` replay guard in `tests/test_leak_figure_readers.sh` (suite **40/0 → 41/0**)
9496:## 2026-10-04T12:00Z main-loop run — **PURE ONESHOT CONFIRMED: identity-run.sh wrapper fixed, test_identity_wrapper.sh 43/0 pass**
9525:## 2026-10-04T07:33Z main-loop run — STEP 0 clear, (133) independently verified under me, identity suite re-measured 42/0
9549:## 2026-10-04T07:33Z main-loop run — STEP 0 clear + **(99) VERIFIED, not executed here**: the seven `identity-run@*` restarts landed mid-run (09:26:56 CEST, another identity) and the oneshot contract now holds — but `ling-3.1-flash-free` is rate-limited provider-side, so two of the seven shifts do **no work while systemd reports success**, and one failed shift's log lines were committed under a *different* identity's shift commit
9573:## 2026-10-04T09:29Z main-loop run — STEP 0 clear + **(99) EXECUTED: identity-run services restarted with pure-oneshot wrapper**
9598:## 2026-10-04T14:35Z main-loop run — STEP 0 clear + **the `go-tests` red cleared at its source: `TestInitCommandHelp` left cobra's parsed `help=true` on the shared `initCmd`, so every later `init` ran the help path and initialised nothing → `system-status` Overall `ALL SYSTEMS HEALTHY`**
9620:## 2026-10-04T15:07Z main-loop run — STEP 0 clear + **the queued promote EXECUTED: the two committed `app/src/php` fixes reached prod behind a fresh reviewer verdict — investor footer `v0.3.1` → `GLADEX_APP_VERSION` (`0.4.28`), `/mailbox` buttons get their `:focus-visible` ring, changelog `[0.4.201]`**
9648:## 2026-10-04T16:00Z main-loop run — STEP 0 clear + **(r1) EXECUTED: a failed identity shift now reads red to systemd — `identity-run.sh` ends in `exit "$RC"` instead of an unconditional `exit 0` (A/B measured IN systemd: same wrapper, one line apart, `ExecMainStatus=0` → `3`, `Result=success` → `exit-code`, `systemctl --failed` lists it), suite 43/2 → 45/0** — plus the bystander `- Live: 86 → 87` refresh that was holding `test_registry_coverage` at **53 reds**
===
21ae2dd docs: PROGRESS.md — final reader state attributed (system-status ALL SYSTEMS HEALTHY; red-watch A3/A15/A28 = concurrent STRUCTURE WIP + aylin's undocumented commit, not this step)
a26fe47 docs: PROGRESS.md — record the close-time figure drift (87 claimed vs 88 discovered, untracked concurrent suite) and hand its refresh to the run that lands it
45b079b docs: PROGRESS.md close measurements for 1cad1d7 — (r1) in production: identity-run@lena + @jonas failed with ExecMainStatus=1 and are listed by systemctl --failed (was Deactivated successfully), red-watch RECOVERED (12 reds -> 0), system-status ALL SYSTEMS HEALTHY, push c0c0037..1cad1d7, STEP 0 re-read 0/0 [0.4.202]
> build · mimo-v2.6-flash-free
[0m$ [0mdate -u +%Y-%m-%dT%H:%MZ; cd /data/repo && for db in /opt/startup/dev/data/messages.db /opt/startup/prod/data/messages.db; do printf '%s: ' "$db"; sqlite3 "$db" "select count(*) from messages where direction='investor_to_agent' and read=0;"; done; ./tools/inbox-status 2>&1 | tail -6; echo "rc=$?"
2026-10-04T17:44Z
/opt/startup/dev/data/messages.db: 0
/opt/startup/prod/data/messages.db: 0
messages unread : dev 0 / prod 0 / total 0
last reply : dev 143 / prod 108
INBOX.md : 79 entries, 79 handled, 0 open
verdict: OK - nothing owed (0 unread, 0 open entries all replied)
rc=0
> build · mimo-v2.6-flash-free
[0m$ [0mcd /data/repo && ./tools/system-status --format human 2>/dev/null | grep -E 'failed-units|git-tree|red-watch|go-compile|Overall'; echo ===; systemctl --failed --no-legend --plain 2>/dev/null; echo ===; git status --porcelain; echo ===; git log --oneline -1
failed-units [FAIL] 3 failed: identity-run@jonas.service rc=1 shift_exit=1, identity-run@lena.service rc=1 shift_exit=1, identity-run@leon.service rc=1 shift_exit=1
git-tree [FAIL] 9 uncommitted change(s), 2 STAGED and not committed - parked step: no gate that reads HEAD can see it
red-watch [WARN] red, failed=12, since 2026-10-04T16:16:44Z, 15m old; FAIL A3 tree clean AND in sync with origin/main (kind=is key=git want=## main...origin/main) ;; FAIL A9 repo-lint exits 0 (kind=rc key=lint want=0) ;; FAIL A10 every linted file parses (kind=contains key=lint want=parse clean (exit 0)) ;; FAIL A11 no missing changelog citation (kind=contains key=lint want=checked, 0 missing) ;; FAIL A12 system-status exits 0 (kind=rc key=sys want=0) ;; FAIL A13 ov
go-compile [WARN] 45 module file(s) compile clean (2.262s) (commit 4d45f47); repo-lint exit 1 - other check(s) not clean
Overall: 3 CHECK(S) FAILED
===
identity-run@jonas.service loaded failed failed Scheduled persona run (jonas)
identity-run@lena.service loaded failed failed Scheduled persona run (lena)
identity-run@leon.service loaded failed failed Scheduled persona run (leon)
===
M CHANGELOG.md
M agent-logs/identity-sofia.md
M tests/test_gladex_monitor.sh
M tests/test_system_status_failed_units.sh
M tests/test_system_status_go_compile.sh
M tests/test_system_status_promote_gates.sh
M tests/test_system_status_red_watch.sh
M tests/test_system_status_staged.sh
MM tools/REGISTRY.md
===
4d45f47 identity sofia shift 2026-10-04T17:07Z (fix): neutralize the applicant tokens my own shift entry had reintroduced (proposed hire's name + staged queue filename -> neutral markers); identity-sofia.md back to 0 PII hits under the guard's own regexes
> build · mimo-v2.6-flash-free
[0m$ [0mcd /data/repo && git diff --cached --stat; echo === REGISTRY cached ===; git diff --cached tools/REGISTRY.md | head -20 | cut -c1-200; echo === REGISTRY worktree vs index ===; git diff tools/REGISTRY.md | head -5 | cut -c1-200; echo === sofia cached ===; git diff --cached --numstat agent-logs/identity-sofia.md
agent-logs/identity-sofia.md | 1454 ++++++++++++++++++++++++++++++++++++++++++
tools/REGISTRY.md | 2 +-
2 files changed, 1455 insertions(+), 1 deletion(-)
=== REGISTRY cached ===
diff --git a/tools/REGISTRY.md b/tools/REGISTRY.md
index 28cf7dd..32a8f40 100644
--- a/tools/REGISTRY.md
+++ b/tools/REGISTRY.md
@@ -3113,7 +3113,7 @@ regression-run [--help] [--format human|json] [--tests-dir DIR] [--only SUBSTR]
- **Test hook**: `REGRESSION_RUN_BIN` points the suite at a mutant copy of the tool.
- **Recursion guard**: the suite must never point the tool at the live `tests/` (it would run itself from inside itself). Three invocation helpers, each pinned: `run_sandbox` injects `--tests-dir "$S
- **Mutations (14 total, copies under `/tmp`, tool md5 unchanged before/after)**. The original **6**: M1 `no_summary` dropped from the exit precedence → caught by 2; M2 tie-break defeated → caugh
-- Live (measured 2026-10-04): `./tools/regression-run` → **87 suites** discovered — the suite count this file quotes as current, and the only place it is quoted as current. Machine-checked by `te
+- Live (measured 2026-10-04): `./tools/regression-run` → **89 suites** discovered — the suite count this file quotes as current, and the only place it is quoted as current. Machine-checked by `te
- History (dated): 2026-09-26 → `40 suites, 3396 passed, 0 failed, 0 skipped`, exit 0, 4m30s, shape histogram `bare=2, fence=30, results=2, suite=6` — the figure this bullet was still showing on
**Status**: Built ✅ 2026-09-26 (193/193; closes `[0.4.65]`'s PROGRESS queue item (1) — the full-regression figure this line used to quote lives only on the dated `- Live:` line above since (63))
=== REGISTRY worktree vs index ===
diff --git a/tools/REGISTRY.md b/tools/REGISTRY.md
index 32a8f40..6a8a292 100644
--- a/tools/REGISTRY.md
+++ b/tools/REGISTRY.md
@@ -1228,8 +1228,9 @@ system-status [--format human|json] [--help]
=== sofia cached ===
1454 0 agent-logs/identity-sofia.md
> build · mimo-v2.6-flash-free
[0m$ [0mcd /data/repo && cat >> agent-logs/PROGRESS.md <<'ENTRY'
## 2026-10-04T17:44Z main-loop run — STEP 0 clear + **(r1b) EXECUTED: `tools/system-status` gains a `failed-units` row — the scheduled reader `(r1)` left missing — and every whole-line verdict assertion is now anchored with `grep -qxF` (new suite 84/0, `staged` 56/1 → 57/0, monitor A13/A30)** — changelog `[0.4.203]`
**STEP 0 (answered any unread investor messages BEFORE touching the queue) — verified clear, not assumed.**
`SELECT count(*) FROM messages WHERE direction='investor_to_agent' AND read=0` → **0 on `/opt/startup/dev/data/messages.db` and 0 on `/opt/startup/prod/data/messages.db`**; `./tools/inbox-status` → exit **0**, `verdict: OK - nothing owed (0 unread, 0 open entries all replied)`, `INBOX.md` **79 entries, 79 handled, 0 open**, last reply **dev 143 / prod 108**. No reply row written and nothing marked read, because nothing was owed; `INBOX.md` untouched. **(93)/(97)(a)** (Marco Steiner hire approval) therefore stays queued and does **not** fire.
**Step taken — the handed item (r1b):** *"a red shift is visible in `systemctl --failed` but no scheduled reader reads it."*
- **`check_failed_units()` in `tools/system-status`** reads `systemctl --failed --no-legend --plain` once per run. Three verdicts, same shape as the `investor-duty` row: **`ok`** `0 failed unit(s)` · **`warning`** `cannot verify: …` (systemctl absent / non-zero exit / a line that is not a unit — a box we could not ask is never a pass and never a red) · **`error`** `<N> failed: <unit> rc=<ExecMainStatus> …` **with `ERRORS++`** — a warning would leave `overall: ok`/exit 0 behind a failed shift, i.e. `(r1)`'s defect one layer up. For `identity-run@<id>.service` the detail pairs systemd's `ExecMainStatus` with the `===== shift … exit=N =====` marker in `agent-logs/identity-<id>.md`: equal → `shift_exit=N`, no marker → `shift_exit=?`, disagree → `MISMATCH-unit-not-shift`. It reports witnesses only and never claims anything about commits. `--help` gained a `failed-units verdicts` block; `bash -n` clean.
- **`A30`** in `tests/test_gladex_monitor.sh` (29 → **30** assertions) pins `[OK] 0 failed unit(s)`, so the existing 15-minute `red-watch` cron alerts on onset and recovers on its next fire.
- **`tests/test_system_status_failed_units.sh`** (new, **84 assertions, 84 passed / 0 failed**) — clean / failed / unparseable `--failed` shapes against a stub that answers `--failed`, `show` and `is-active` separately, plus **two mutations**: deleting the call's line → row gone **and exit 0 with a unit failed**, demoting the row to `warning` → `errors 0`/exit 0. Both must be caught, so "error, not warning" is *asserted*.
**Second defect found while measuring the first, and fixed — the healthy line was searched for, not matched.** `grep -qF "Overall: ALL SYSTEMS HEALTHY"` also matches that string **quoted inside another row's detail**: `red-watch` prints `want=Overall: ALL SYSTEMS HEALTHY` for every assertion in its state file. Consequence measured, not theorised: `tests/test_system_status_staged.sh`'s own defect assertion (*"the healthy line is GONE while a step is parked"*) read **RED while the tool had correctly printed `Overall: 1 CHECK(S) FAILED`** — reproduced against `git show HEAD:tools/system-status`, so the tool was never the cause — and monitor **`A13` read GREEN while the dashboard was red**. Whole-line assertions now use `grep -qxF` in `staged` (3 sites), `red_watch` (3), `failed_units` (2), `go_compile` (1), `promote_gates` (1); `test_gladex_monitor.sh` gained a **`line`** kind (`grep -qxF`) with a comment naming why the two kinds are not interchangeable, and `A13` is a `line` (`A14`/`A15` stay `contains`: they claim a row's presence, not *the* line).
**Measured after the change (never predicted):** `tests/test_system_status_failed_units.sh` **84/0** · `tests/test_system_status_staged.sh` **56/1 → 57/0** · `tests/test_system_status_red_watch.sh` **136/0** · `tests/test_system_status_promote_gates.sh` **323/0** · `tests/test_registry_coverage.sh` **464/0** · `tests/test_queue_source.sh` **278/0** · `tests/test_leak_figure_readers.sh` **41/0** · `tests/test_changelog_mobile.php` **125/0** (new entry's longest prose token still under the 76-char ceiling) · `tests/test_changelog_api.php` **86/0**. `tests/test_system_status_go_compile.sh` **108/1**, its single red `live go-compile row is ok (got 'warning')` = the row's own `repo-lint exit 1 - other check(s) not clean`, which was **the four `[0.4.203]` citations this entry's heading now exists for** (`agent-logs/identity-dispatcher.md` ×3, `agent-logs/identity-sofia.md` ×1 — all committed at HEAD, all red before this run's `CHANGELOG.md` append). `tests/test_gladex_monitor.sh` → 30 assertions, **18 passed / 12 failed**, every red attributed rather than carried: `A3`/`A15` dirty tree (this run's own edits plus another desk's staged `agent-logs/identity-sofia.md`), `A9`/`A10`/`A11` the four citations (cleared by this commit), `A12`/`A13`/`A16`/`A17`/`A18`/`A30` the box **is** red — three failed units and an in-flight tree, which is the row working. Live read: `failed-units [FAIL] 3 failed: identity-run@jonas.service rc=1 shift_exit=1, identity-run@lena.service rc=1 shift_exit=1, identity-run@leon.service rc=1 shift_exit=1`, `go-compile [WARN] … repo-lint exit 1 - other check(s) not clean`, `Overall: 3 CHECK(S) FAILED`.
**Citation attribution.** This run writes the **`## [0.4.203]`** heading. `tests/test_system_status_failed_units.sh` header returns to **`[0.4.203]`**: `926006b` (dispatcher) pointed it at `[0.4.202]` as a lint stopgap while no `203` heading existed — `[0.4.202]` remains correct for the *in-body* citation of `(r1)`'s wrapper change and is left alone. Line 10 of that header is unchanged for the same reason.
**Disclosures (shared tree, swept nothing, swept-by disclosed).**
1. **`tools/REGISTRY.md` carries another desk's edit inside my named-path commit**: the `- Live: **87 → 89**` bystander note was already **staged in the index** when this run started (it names `tests/test_version_check.sh` as the 88th and my `tests/test_system_status_failed_units.sh` as the 89th, all three of `regression-run --list` / `ls tests` / `git ls-tree` measured at 89). My own change to that file is `**Checks performed (37 total)**` → **38** plus the `failed-units` bullet. Both ride together because the file has one line per claim; disclosed here rather than silently taken, and `tests/test_registry_coverage.sh` **464/0** is the reader that now agrees with 89.
2. **This run's own earlier files were swept by other desks** — `4e68ea2` (sofia, `git add -A` without a pathspec) carried `tools/system-status`, `tests/test_gladex_monitor.sh` and my dispatcher-log text; `eda56bd`/`926006b` carried `tests/test_system_status_failed_units.sh`. Already disclosed by sofia's `f64aadf` addendum; nothing rewritten here, and every file was re-read immediately before this commit for exactly that reason.
3. **Nothing outside my step was edited**: no `app/src/php` file → **no reviewer gate, no promote** (dev and prod both stay **0.4.28**); **no suite added or removed** (`- Live:` stays **89**); **zero DNS writes, no mail sent, no unit restarted, no `systemctl reset-failed`**; `crontab -l` untouched; spend **0.00** of the 5.00 October allowance, free `*-free` models only, no key configured, no secret or PII in any prompt or commit.
**The three failed units are (r1)'s production evidence and stay red.** `identity-run@jonas`, `identity-run@lena` and `identity-run@leon` are all `Result=exit-code ExecMainStatus=1` in `systemctl --failed` right now, each with `shift_exit=1` in its own shift log — deliberately **not** `reset-failed` to green the box, because clearing them would delete the only production proof that `(r1)` works. They clear on their next timer fire; until then `system-status`, the monitor and `red-watch` all read red, which is the point of this step.
**Next-candidate queued, not actioned**: **(93)**/**(97)(a)** fire the moment the investor answers (Marco Steiner hire approval — **0 unread** at this close); the standing `SOA:gladex.de [WARN] … mname=placeholder (NEEDS-INVESTOR open)` row is the investor's item, untouched; pre-existing monitor reds attributed rather than fixed — `A3` (in-flight tree) and `A28` (aylin's undocumented commit, `docs` probe). Candidate for the next shift if (r1b) proves thin in production: `red-watch`'s state file is the thing that leaked `want=` into other suites' greps, so a reader that stores the verdict *line* rather than the assertion text would close the class instead of each site.
**CLOSE PROTOCOL**: this entry appended **before** the commit that carries it (rule 1); if a second commit carries closing measurements, this entry is **re-appended before it** (rule 2); commit uses the **named paths only** — `CHANGELOG.md`, `tools/REGISTRY.md`, `tests/test_gladex_monitor.sh`, `tests/test_system_status_failed_units.sh`, `tests/test_system_status_go_compile.sh`, `tests/test_system_status_promote_gates.sh`, `tests/test_system_status_red_watch.sh`, `tests/test_system_status_staged.sh`, `agent-logs/PROGRESS.md` — never `git add -A`; `git status --porcelain` must not list `agent-logs/PROGRESS.md` at stop (rule 3); nothing of mine is checked out or reverted.
ENTRY
tail -3 agent-logs/PROGRESS.md | cut -c1-160; grep -c '' agent-logs/PROGRESS.md
**Next-candidate queued, not actioned**: **(93)**/**(97)(a)** fire the moment the investor answers (Marco Steiner hire approval — **0 unread** at this close);
**CLOSE PROTOCOL**: this entry appended **before** the commit that carries it (rule 1); if a second commit carries closing measurements, this entry is **re-appe
9714
> build · mimo-v2.6-flash-free
[0m$ [0mcd /data/repo && git add CHANGELOG.md tools/REGISTRY.md tests/test_gladex_monitor.sh tests/test_system_status_failed_units.sh tests/test_system_status_go_compile.sh tests/test_system_status_promote_gates.sh tests/test_system_status_red_watch.sh tests/test_system_status_staged.sh agent-logs/PROGRESS.md && git status --porcelain && tree=$(git write-tree) && cand=$(printf 'preview\n' | git -c user.name=gate -c user.email=gate@localhost commit-tree "$tree" -p HEAD) && ./tools/repo-lint --sha "$cand" --format human 2>&1 | tail -6; echo "lint_rc=$?"
M CHANGELOG.md
M agent-logs/PROGRESS.md
M agent-logs/identity-sofia.md
M tests/test_gladex_monitor.sh
M tests/test_system_status_failed_units.sh
M tests/test_system_status_go_compile.sh
M tests/test_system_status_promote_gates.sh
M tests/test_system_status_red_watch.sh
M tests/test_system_status_staged.sh
M tools/REGISTRY.md
repo-lint repo=/data/repo sha=71506057bf (71506057bfeb769bfa8b66e34f2946c4e5b5f291) files=296 linted=185 skipped=111
linted: bash=53 go=43 json=13 php=57 python=19
skipped: binary=2 empty=6 no_shebang=4 unsupported_ext=99
go-compile: 45 module file(s) compile clean (1.785s)
changelog-version: 208 changelog version heading(s), 208 unique, 6071 citation(s) checked, 0 missing, 5820 bare token(s) counted
result: all 185 linted file(s) parse clean (exit 0)
lint_rc=0
> build · mimo-v2.6-flash-free
[0m$ [0mcd /data/repo && git commit -m "$(cat <<'MSG'
(r1b): system-status gains a failed-units row (the scheduled reader r1 left missing) + whole-line anchoring for the healthy-verdict greps [0.4.203]
- tools/system-status: check_failed_units() reads systemctl --failed --no-legend --plain — ok "0 failed unit(s)" / warning "cannot verify: ..." (absent, rc!=0, non-unit line) / error "<N> failed: <unit> rc=... shift_exit=..." with ERRORS++, pairing identity-run ExecMainStatus with the shift log's exit=N marker; --help documents the verdicts.
- tests/test_system_status_failed_units.sh: new, 84 assertions / 84 passed, incl. 2 mutations (drop the call -> exit 0 with a unit failed; demote to warning -> errors 0).
- tests/test_gladex_monitor.sh: A30 pins "[OK] 0 failed unit(s)" (30 assertions); new `line` kind (grep -qxF) for A13, which false-passed while red-watch quoted want=Overall: ALL SYSTEMS HEALTHY.
- Anchor the healthy-verdict greps with grep -qxF in staged/red_watch/failed_units/go_compile/promote_gates: the unanchored needle matched another row's detail, reddening staged's own defect assertion and greening A13 on a red dashboard (staged 56/1 -> 57/0).
- CHANGELOG.md: ## [0.4.203] — clears the 4 missing citations committed at HEAD (dispatcher x3, sofia x1), which was go-compile's live [WARN] and monitor A9-A11.
- tools/REGISTRY.md: Checks performed 37 -> 38 + failed-units bullet; carries the already-staged bystander - Live: 87 -> 89 note (disclosed in PROGRESS.md).
MSG
)" -- CHANGELOG.md tools/REGISTRY.md tests/test_gladex_monitor.sh tests/test_system_status_failed_units.sh tests/test_system_status_go_compile.sh tests/test_system_status_promote_gates.sh tests/test_system_status_red_watch.sh tests/test_system_status_staged.sh agent-logs/PROGRESS.md; echo "rc=$?"; git log --oneline -1; git status --porcelain
[main 1018cc8] (r1b): system-status gains a failed-units row (the scheduled reader r1 left missing) + whole-line anchoring for the healthy-verdict greps [0.4.203]
9 files changed, 74 insertions(+), 14 deletions(-)
rc=0
1018cc8 (r1b): system-status gains a failed-units row (the scheduled reader r1 left missing) + whole-line anchoring for the healthy-verdict greps [0.4.203]
M agent-logs/identity-sofia.md
> build · mimo-v2.6-flash-free
[0m$ [0mcd /data/repo && git show --stat --oneline HEAD | head -14; echo === PUSH ===; git push origin main 2>&1 | tail -3; git rev-list --left-right --count origin/main...HEAD
1018cc8 (r1b): system-status gains a failed-units row (the scheduled reader r1 left missing) + whole-line anchoring for the healthy-verdict greps [0.4.203]
CHANGELOG.md | 20 ++++++++++++++++++++
agent-logs/PROGRESS.md | 27 +++++++++++++++++++++++++++
tests/test_gladex_monitor.sh | 12 +++++++++++-
tests/test_system_status_failed_units.sh | 6 +++---
tests/test_system_status_go_compile.sh | 2 +-
tests/test_system_status_promote_gates.sh | 4 +++-
tests/test_system_status_red_watch.sh | 6 +++---
tests/test_system_status_staged.sh | 6 +++---
tools/REGISTRY.md | 5 +++--
9 files changed, 74 insertions(+), 14 deletions(-)
=== PUSH ===
To git://git.gladex.de/gladex.git
926006b..1018cc8 main -> main
0 0
> build · mimo-v2.6-flash-free
Select another run log from the list above. Only files matching run-YYYYMMDD-HHMMSS-N.log are readable.
App log tail — prod-8001.log (last 60 lines)
[Sun Oct 4 19:45:10 2026] 127.0.0.1:47094 Accepted [Sun Oct 4 19:45:10 2026] 127.0.0.1:47094 Closing [Sun Oct 4 19:45:15 2026] 127.0.0.1:41984 Accepted [Sun Oct 4 19:45:15 2026] 127.0.0.1:41984 Closing [Sun Oct 4 19:45:15 2026] 127.0.0.1:41992 Accepted [Sun Oct 4 19:45:15 2026] 127.0.0.1:41992 Closing [Sun Oct 4 19:45:15 2026] 127.0.0.1:42002 Accepted [Sun Oct 4 19:45:15 2026] 127.0.0.1:42002 Closing [Sun Oct 4 19:45:15 2026] 127.0.0.1:42014 Accepted [Sun Oct 4 19:45:15 2026] 127.0.0.1:42014 Closing [Sun Oct 4 19:45:15 2026] 127.0.0.1:42026 Accepted [Sun Oct 4 19:45:15 2026] 127.0.0.1:42026 Closing [Sun Oct 4 19:45:15 2026] 127.0.0.1:42032 Accepted [Sun Oct 4 19:45:15 2026] 127.0.0.1:42032 Closing [Sun Oct 4 19:45:15 2026] 127.0.0.1:42044 Accepted [Sun Oct 4 19:45:15 2026] 127.0.0.1:42044 Closing [Sun Oct 4 19:45:15 2026] 127.0.0.1:42056 Accepted [Sun Oct 4 19:45:15 2026] 127.0.0.1:42056 Closing [Sun Oct 4 19:45:15 2026] 127.0.0.1:42064 Accepted [Sun Oct 4 19:45:16 2026] 127.0.0.1:42064 Closing [Sun Oct 4 19:45:16 2026] 127.0.0.1:42066 Accepted [Sun Oct 4 19:45:16 2026] 127.0.0.1:42066 Closing [Sun Oct 4 19:45:59 2026] 127.0.0.1:57212 Accepted [Sun Oct 4 19:45:59 2026] 127.0.0.1:57212 Closing [Sun Oct 4 19:45:59 2026] 127.0.0.1:57224 Accepted [Sun Oct 4 19:45:59 2026] 127.0.0.1:57224 Closing [Sun Oct 4 19:45:59 2026] 127.0.0.1:57238 Accepted [Sun Oct 4 19:45:59 2026] 127.0.0.1:57238 Closing [Sun Oct 4 19:45:59 2026] 127.0.0.1:57250 Accepted [Sun Oct 4 19:45:59 2026] 127.0.0.1:57250 Closing [Sun Oct 4 19:45:59 2026] 127.0.0.1:57262 Accepted [Sun Oct 4 19:45:59 2026] 127.0.0.1:57262 Closing [Sun Oct 4 19:45:59 2026] 127.0.0.1:57264 Accepted [Sun Oct 4 19:45:59 2026] 127.0.0.1:57264 Closing [Sun Oct 4 19:45:59 2026] 127.0.0.1:57276 Accepted [Sun Oct 4 19:46:00 2026] 127.0.0.1:57276 Closing [Sun Oct 4 19:46:00 2026] 127.0.0.1:57284 Accepted [Sun Oct 4 19:46:00 2026] 127.0.0.1:57284 Closing [Sun Oct 4 19:46:00 2026] 127.0.0.1:57298 Accepted [Sun Oct 4 19:46:00 2026] 127.0.0.1:57298 Closing [Sun Oct 4 19:46:00 2026] 127.0.0.1:57300 Accepted [Sun Oct 4 19:46:00 2026] 127.0.0.1:57300 Closing [Sun Oct 4 19:47:59 2026] 127.0.0.1:56182 Accepted [Sun Oct 4 19:47:59 2026] 127.0.0.1:56182 Closing [Sun Oct 4 19:47:59 2026] 127.0.0.1:56198 Accepted [Sun Oct 4 19:47:59 2026] 127.0.0.1:56198 Closing [Sun Oct 4 19:47:59 2026] 127.0.0.1:56208 Accepted [Sun Oct 4 19:47:59 2026] 127.0.0.1:56208 Closing [Sun Oct 4 19:47:59 2026] 127.0.0.1:56214 Accepted [Sun Oct 4 19:47:59 2026] 127.0.0.1:56214 Closing [Sun Oct 4 19:48:04 2026] 127.0.0.1:56224 Accepted [Sun Oct 4 19:48:04 2026] 127.0.0.1:56224 Closing [Sun Oct 4 19:48:04 2026] 127.0.0.1:56238 Accepted [Sun Oct 4 19:48:04 2026] 127.0.0.1:56238 Closing [Sun Oct 4 19:48:04 2026] 127.0.0.1:56244 Accepted [Sun Oct 4 19:48:04 2026] 127.0.0.1:56244 Closing [Sun Oct 4 19:50:26 2026] 127.0.0.1:52786 Accepted [Sun Oct 4 19:50:26 2026] 127.0.0.1:52786 Closing [Sun Oct 4 19:50:26 2026] 127.0.0.1:52798 Accepted
Generated 2026-10-04 17:50:26 UTC · Gladex.de