Gladex Agent Logs

Agent run logs & app logs · env: prod · LAN-only investor surface

Overview
Run logs1152 files, 62.3 MB
Latest run logrun-20261004-165539-686.log
Log directory/data/agent-logs
App log directory/opt/startup/prod/logs
Run logs (newest first, last 50)
FileSizeModified (UTC)
run-20261004-165539-686.log 140 KB 2026-10-04 15:15:10
run-20261004-161338-685.log 176 KB 2026-10-04 14:45:31
run-20261004-160330-684.log 153 B 2026-10-04 14:03:31
run-20261004-155322-683.log 153 B 2026-10-04 13:53:23
run-20261004-154314-682.log 190 B 2026-10-04 13:43:15
run-20261004-153306-681.log 153 B 2026-10-04 13:33:07
run-20261004-152258-680.log 153 B 2026-10-04 13:22:58
run-20261004-151250-679.log 190 B 2026-10-04 13:12:50
run-20261004-150241-678.log 153 B 2026-10-04 13:02:42
run-20261004-145233-677.log 153 B 2026-10-04 12:52:34
run-20261004-144225-676.log 190 B 2026-10-04 12:42:26
run-20261004-143217-675.log 153 B 2026-10-04 12:32:17
run-20261004-142209-674.log 153 B 2026-10-04 12:22:09
run-20261004-141201-673.log 153 B 2026-10-04 12:12:01
run-20261004-140152-672.log 153 B 2026-10-04 12:01:53
run-20261004-135144-671.log 153 B 2026-10-04 11:51:44
run-20261004-134136-670.log 153 B 2026-10-04 11:41:36
run-20261004-133127-669.log 153 B 2026-10-04 11:31:27
run-20261004-132119-668.log 153 B 2026-10-04 11:21:19
run-20261004-131110-667.log 153 B 2026-10-04 11:11:10
run-20261004-130101-666.log 190 B 2026-10-04 11:01:02
run-20261004-125053-665.log 153 B 2026-10-04 10:50:54
run-20261004-124045-664.log 153 B 2026-10-04 10:40:45
run-20261004-123036-663.log 153 B 2026-10-04 10:30:37
run-20261004-122028-662.log 153 B 2026-10-04 10:20:29
run-20261004-121020-661.log 153 B 2026-10-04 10:10:20
run-20261004-120011-660.log 153 B 2026-10-04 10:00:11
run-20261004-115003-659.log 153 B 2026-10-04 09:50:03
run-20261004-113954-658.log 153 B 2026-10-04 09:39:55
run-20261004-112946-657.log 153 B 2026-10-04 09:29:47
run-20261004-111938-656.log 153 B 2026-10-04 09:19:39
run-20261004-110930-655.log 153 B 2026-10-04 09:09:31
run-20261004-105922-654.log 153 B 2026-10-04 08:59:23
run-20261004-104914-653.log 153 B 2026-10-04 08:49:14
run-20261004-103906-652.log 153 B 2026-10-04 08:39:06
run-20261004-102858-651.log 153 B 2026-10-04 08:28:58
run-20261004-101850-650.log 153 B 2026-10-04 08:18:50
run-20261004-100839-649.log 153 B 2026-10-04 08:08:42
run-20261004-095831-648.log 190 B 2026-10-04 07:58:32
run-20261004-094823-647.log 190 B 2026-10-04 07:48:24
run-20261004-084508-646.log 326 KB 2026-10-04 07:38:14
run-20261004-092437-3.log 78 KB 2026-10-04 07:26:56
run-20261004-084559-2.log 370 KB 2026-10-04 07:26:51
run-20261004-091526-2.log 324 KB 2026-10-04 07:26:09
run-20261004-090048-2.log 179 KB 2026-10-04 07:24:18
run-20261004-091549-5.log 199 KB 2026-10-04 07:23:22
run-20261004-092213-43.log 151 B 2026-10-04 07:22:13
run-20261004-090046-3.log 214 KB 2026-10-04 07:22:05
run-20261004-090853-2.log 36 KB 2026-10-04 07:14:29
run-20261004-091204-42.log 151 B 2026-10-04 07:12:05
Tail — run-20261004-161338-685.log (last 200 lines)
      1 --- PASS: TestWorkflowValidateEmptySteps (0.71s)
      1 --- PASS: TestWorkflowValidateHelp (0.74s)
      1 --- PASS: TestWorkflowValidateInvalidJSON (0.72s)
      1 --- PASS: TestWorkflowValidateJSONOutput (0.70s)
      1 --- PASS: TestWorkflowValidateMissingConfig (0.70s)
      1 --- PASS: TestWorkflowValidateNoInput (0.70s)
      1 --- PASS: TestWorkflowValidateUnknownStepType (0.72s)
      1 --- PASS: TestWorkflowValidateValidWorkflow (0.71s)
      1 --- SKIP: TestRootCommandHasExplicitOutputWriter (0.00s)
      1 --- SKIP: TestStatusGoFmtCompliance (0.01s)
=== package lines
ok  	github.com/gladex/gladex/cmd/gladex	0.945s
ok  	github.com/gladex/gladex/cmd/gladex/commands	26.670s
> build · mimo-v2.6-flash-free
$ cd /data/repo && ./tools/budget-show --format json | head -20; echo "=== suite census"; grep -c "tests/" tools/REGISTRY.md >/dev/null; grep -n "\- Live:" tools/REGISTRY.md | tail -3; echo "=== monitor A-checks for health"; grep -n "A12\|A13\|A3 " tests/test_gladex_monitor.sh | head -12
{
  "month": "2026-10",
  "allowance": "5.00",
  "spent": "0.00",
  "spent_note": "no October charge recorded anywhere — gladex.de renews at 1.50/mo, renewal date NOT on file, raised as NEEDS-INVESTOR in REPORT.md §14, so this figure may understate a known recurring cost",
  "remaining": "5.00",
  "log": [
    "2026-09-20: init, no domains ordered yet",
    "2026-09-20: investor APPROVED gladex.de (1.50/mo). Awaiting registrar purchase + DNS creds.",
    "2026-09-20: purchase completed same day — RDAP status active (changed 2026-09-20T11:10:57+02:00), DNS wired via pdns wrapper (A apex/dev/git/info/stats/log/team -> 77.90.15.49, MX 10 gladex.de), dig-verified; DOMAIN.md holds evidence.",
    "2026-09-24: ledger narrative corrected — spent-line still said \"purchase pending at registrar\" 4 days after registration (queued candidate #1); numbers unchanged (1.50/3.50, no money moved), log history above kept verbatim.",
    "2026-10-01: month rolled per brief §4 (balance resets to 5.00 on the 1st, unspent does NOT roll over). September history above is kept verbatim; September closed at spent 1.50 / remaining 3.50.",
    "2026-10-02: October opened at spent 0.00 / remaining 5.00 because no October charge exists in any file on this box — while gladex.de is a known 1.50/mo recurring cost with NO renewal date recorded anywhere. Figure to be corrected the moment the investor answers REPORT.md §14."
  ],
  "warnings": []
}
=== suite census
5667:**Status**: Built ✅ 2026-10-02 (queue item **(116)**, `[0.4.173]`; `- Live:`
5752:assertions green in ~15s; `- Live:` suite figure refreshed **82 → 83** in the
5807:the two reds exactly C1's; `- Live:` suite figure refreshed **85 → 86** in the
=== monitor A-checks for health
125:add A3  is          git        "## main...origin/main"                      "tree clean AND in sync with origin/main"
134:add A12 rc          sys        0                                            "system-status exits 0"
135:add A13 contains    sys        "Overall: ALL SYSTEMS HEALTHY"               "overall healthy"
> build · mimo-v2.6-flash-free
$ cd /data/repo/app/src/go && GOPATH=/tmp/gopath GOMODCACHE=/tmp/gopath/pkg/mod GOCACHE=/tmp/gocache timeout 300 go test ./... -count=1 -short -v 2>&1 | grep -E "^--- (PASS|FAIL|SKIP)" | awk '{print $2}' | sort | uniq -c; echo "=== list count"; go test ./cmd/gladex/commands/ -list '.*' 2>/dev/null | grep -c '^Test'
220 PASS:
      2 SKIP:
=== list count
0
> build · mimo-v2.6-flash-free
$ cd /data/repo && cat >> CHANGELOG.md <<'EOF'

## [0.4.200] - 2026-10-04 — `go-tests` red cleared at its source: `TestInitCommandHelp` left cobra's parsed `help=true` on the shared `initCmd`, so every later `init` took the help path and initialised **nothing** (package **FAIL → ok**, `system-status` Overall **ALL SYSTEMS HEALTHY**)

### Fixed
- **The order-dependent `TestStatusUsesConfigPort` failure that reddened `tools/system-status`'s `go-tests` row.** `app/src/go/cmd/gladex/commands/root_test.go`'s `TestInitCommandHelp` runs `init --help` through the package-level `rootCmd`. cobra@v1.8.1 reads the parsed flag **value** on every `execute()` (`helpVal, err := c.Flags().GetBool("help")` → `return flag.ErrHelp`) while `InitDefaultHelpFlag()` only *creates* the flag and never resets it, so `initCmd` stayed `help=true` for the rest of the process: every later `Execute()` on `initCmd` took the help path, and `ExecuteC` turns `flag.ErrHelp` into a printed help screen and a **nil** error — i.e. `init` reported success having created no `.gladex/`. `TestStatusUsesConfigPort` (landed today in `40d6d00`/`ed006cf`/`94d8cc7`) then read `…/.gladex/config.json: no such file or directory` and failed, which is what made `go-tests` red and, with it, `A12`/`A13`/`A16`/`A17`/`A18` of `tests/test_gladex_monitor.sh`. Fix: `defer initCmd.Flags().Set("help", "false")` in `TestInitCommandHelp`, so the singleton is restored for every later test in the same process — the pollution source, not the symptom.
- **Root cause bisected, not guessed.** `go test -run 'TestInitCommandHelp|TestStatusUsesConfigPort'` reproduced the red in 0.00 s; the same two tests pass after the fix. The pre-fix full package failed **three times in a row** with the identical message, with `HOME` set and unset alike, while `TestStatus.*` alone, and every other test group tried (`TestContext.*`, `TestIntegration.*`, `TestMCP*`, `TestDoctor*`, `TestServe*`, `TestTemplate*`, `TestWorkflow*`, `TestValidateToolCall*`, `TestShippedExampleTemplatesAreValid`, `TestNoWorkspaceMessageIsShared`), read **ok** — only `TestInitCommandHelp` in front of it reddens it. The hazard is already named in this package (`trust_test.go`: *"avoids cobra state pollution from shared initCmd"*).

### Tests
- **Before:** `go test ./... -count=1 -short` → `FAIL github.com/gladex/gladex/cmd/gladex/commands`, `--- FAIL: TestStatusUsesConfigPort (0.00s)` (`status_test.go:476`), reproduced on three consecutive full runs. **After:** both packages **ok** — `github.com/gladex/gladex/cmd/gladex` 0.9 s and `github.com/gladex/gladex/cmd/gladex/commands` 26.7 s, **220 passed / 0 failed / 2 skipped** (`TestRootCommandHasExplicitOutputWriter`, `TestStatusGoFmtCompliance` — both pre-existing SKIPs). `tools/system-status` now reads `go-tests [OK] passing` and **`Overall: ALL SYSTEMS HEALTHY`** (it read `Overall: 1 CHECK(S) FAILED` before this run). `gofmt -l` on the touched file is empty (the file's pre-existing missing trailing newline was closed while editing it; `root.go` and `main.go` still lack theirs and were left alone). No `app/src/php` file touched — no reviewer gate, no promote (prod stays **0.4.28**).

### Notes
- **Scope: one file.** `app/src/go/cmd/gladex/commands/root_test.go` (+ `CHANGELOG.md`, `agent-logs/PROGRESS.md`); no suite added or removed (`- Live:` stays **86**), `tools/REGISTRY.md` untouched, no service restarted, `crontab -l` → 2 lines, zero DNS writes, no mail sent, spend **0.00** of the 5.00 October allowance (free `*-free` models only), no secrets or PII in any prompt, file or commit.
- **Attribution.** The red test was committed by three identity shifts this morning (`40d6d00` dispatcher, `ed006cf` jonas, `94d8cc7` lena); this run fixed the shared-state trap they could not see from inside one test. Nothing of theirs was edited, staged or reverted — `git status --porcelain` held exactly this run's `root_test.go` when the fix was written.

### Queue
Authoritative next-candidate queue lives in `agent-logs/PROGRESS.md`, in the `Next-candidate queued, not actioned` bullet of the newest run entry — it is not duplicated here, and has not been since `[0.4.67]`. To read the live queue, open `PROGRESS.md`; to know whether that is still true, run `tools/queue-source-check`.
EOF
grep -c "^\[0.4.200\]" CHANGELOG.md; grep -c "## \[0.4.200\]" CHANGELOG.md; grep -c "\[0.4.200\]" CHANGELOG.md; tail -4 CHANGELOG.md | head -2; ./tools/repo-lint --format json 2>&1 | python3 -c "import json,sys; d=json.load(sys.stdin); print('exit',d.get('exit_code'),'failures',d.get('failures'))"
0
1
1
- **Attribution.** The red test was committed by three identity shifts this morning (`40d6d00` dispatcher, `ed006cf` jonas, `94d8cc7` lena); this run fixed the shared-state trap they could not see from inside one test. Nothing of theirs was edited, staged or reverted — `git status --porcelain` held exactly this run's `root_test.go` when the fix was written.

exit 0 failures []
> build · mimo-v2.6-flash-free
$ cd /data/repo && cat >> agent-logs/PROGRESS.md <<'EOF'

---

## 2026-10-04T14:35Z main-loop run — STEP 0 clear + **the `go-tests` red cleared at its source: `TestInitCommandHelp` left cobra's parsed `help=true` on the shared `initCmd`, so every later `init` ran the help path and initialised nothing → `system-status` Overall `ALL SYSTEMS HEALTHY`**

- **STEP 0 first, nothing owed** — `SELECT ... FROM messages WHERE direction='investor_to_agent' AND read=0` read directly on both DBs → **0 dev / 0 prod**; `./tools/inbox-status` → **exit 0, "OK - nothing owed (0 unread, 0 open entries all replied)"**; `INBOX.md` **79 entries / 79 handled / 0 open** (last handled: the 2026-09-30 hiring entry, `~~HANDLED 2026-10-04T06:45:00Z~~`), last reply dev **143** / prod **108**. No `agent_to_investor` row written, no `INBOX.md` entry opened — the thread was never touched this run, re-read again at this close with the same 0 / 0.

- **Queue read, and why the handed item was verified rather than taken.** The newest entry said *next run **(93)**/**(97)(a)** if the investor has answered, otherwise wait for running identity shifts to complete*. The investor has **not** answered (0 unread, so the Marco Steiner hire proposal is still pending approval — `hiring/queue/marco-steiner.json` `status: proposed`), and the shifts **are** complete: all seven `identity-run@*.service` units read **`inactive (dead)`** with every `identity-run@*.timer` **active/waiting**, last fires 13:06–13:55 CEST, next 18:05–18:55 CEST — the oneshot contract is holding (no `activating` unit, no `sleep 600` anywhere in the box). **(r1)** (a failed shift must not read green) stays queued *and stays blocked on its own caveat*: `tests/test_identity_wrapper.sh` **case2** pins `wrapper exit` **0** for an inner `STUB_RC=3`, so propagating `$RC` would break a deliberately pinned contract — and both it and the wrapper are system scope, rewritten by another identity hours ago. So this run took the **red that was actually readable**: `tools/system-status` was reporting `go-tests [FAIL] failing: cmd/gladex/commands (worktree)` and `Overall: 1 CHECK(S) FAILED`.

- **Root cause found by bisection, not by guessing.** `go test ./... -count=1 -short` failed three consecutive times with the identical line `--- FAIL: TestStatusUsesConfigPort` → `status_test.go:476: failed to read config: open /tmp/TestStatusUsesConfigPort*/.gladex/config.json: no such file or directory`, while the same test passed **on its own**. Stripping groups out of the run (`TestStatus.*`, `TestContext.*`, `TestIntegration.*`, `TestMCP*`, `TestDoctor*`, `TestServe*`, `TestTemplate*`, `TestWorkflow*`, `TestValidateToolCall*`, `TestShippedExampleTemplatesAreValid`, `TestNoWorkspaceMessageIsShared`) each read **ok**; the two-test pair `-run 'TestInitCommandHelp|TestStatusUsesConfigPort'` reproduced it in **0.00 s**. Mechanism, read from `cobra@v1.8.1` in the module cache: `execute()` does `helpVal, _ := c.Flags().GetBool("help")` and `if helpVal { return flag.ErrHelp }`, while `InitDefaultHelpFlag()` only *creates* the flag (`if c.Flags().Lookup("help") == nil`) and never resets it — so `root_test.go`'s `TestInitCommandHelp` (`init --help`) left `initCmd`'s parsed `help=true` **for the whole process**, every later `Execute()` on `initCmd` took the help path, and `ExecuteC` turns `flag.ErrHelp` into a help screen and a **nil** error. `init` therefore reported success having written no `.gladex/` at all — the symptom the status test saw. `HOME` set/unset changed nothing (ruled out by measurement).

- **Fix: restore the singleton at the pollution source, one file.** `defer func() { _ = initCmd.Flags().Set("help", "false") }()` in `TestInitCommandHelp`, with a comment quoting the cobra lines and the reproduction command, so the *next* test that runs `init` in the same process is not silently sabotaged (the hazard is already named in-package: `trust_test.go` — *"avoids cobra state pollution from shared initCmd"*). The file's **pre-existing missing trailing newline** was closed while editing it, so `gofmt -l` on it is empty; `root.go` and `main.go` have the same defect and were **left alone** (not this step).

- **Measured after the fix.** `go test ./... -count=1 -short` → **both packages `ok`** (`cmd/gladex` 0.945s, `cmd/gladex/commands` 26.670s), verbose count **220 passed / 0 failed / 2 skipped** (both skips pre-existing: `TestRootCommandHasExplicitOutputWriter`, `TestStatusGoFmtCompliance`); before the fix the same command was `FAIL` on `cmd/gladex/commands`. `./tools/system-status` → `go-tests [OK] passing (worktree, 1 uncommitted Go file(s))`, `go-compile [OK] 45 module file(s) compile clean`, **`Overall: ALL SYSTEMS HEALTHY`** (it read `Overall: 1 CHECK(S) FAILED` at 14:16Z). `./tools/repo-lint` → **exit 0, `failures []`**. `tools/queue-source-check` → **exit 0**, "one queue: [0.4.199] …" at write time — this entry names **[0.4.200]**, re-read at the close.

- **Nothing else moved**: no `app/src/php` file touched → **no reviewer gate, no promote** (dev and prod both **0.4.28**, `healthcheck` → dev **HEALTHY 200**, prod **HEALTHY 200**); no suite added or removed (`- Live:` **86**), `tools/REGISTRY.md` untouched; **no service restarted**, `crontab -l` → **2** lines; **zero DNS writes**; no mail sent; no history rewrite; `git status --porcelain` held **exactly one** file — this run's `root_test.go` — before staging, so no other identity's work was staged, edited or reverted. The red test itself was committed by three identity shifts this morning (`40d6d00` dispatcher, `ed006cf` jonas, `94d8cc7` lena) — they get the credit for the test, this run for the fix. Spend **0.00** of the 5.00 October allowance (`budget-show --format json`: 5.00 / 0.00 / 5.00, `warnings []`), free `*-free` models only, no secrets or PII in any prompt, file or commit.

- **Next-candidate queued, not actioned**: **(93)**/**(97)(a)** fire the moment the investor answers (Marco Steiner hire approval — 0 unread at this close); **(r1)** *a failed shift must not read green* — blocked on `tests/test_identity_wrapper.sh` case2 pinning `exit 0`, so the next owner must change wrapper **and** test together, or accept a reader-side check instead of exit-code propagation; **(r2)** *the path-scoped auto-commit cannot tell who changed a file* (measured on `2a7bc39`); the two repo-newer-than-env PHP fixes (`2803360` footer version constant, `30a6574` mailbox `:focus-visible`) still awaiting a reviewer-gated promote — `source-sync-check` reads **DRIFT 4 file(s)** (dev and prod each) and `promote-gates` reads **REFUSED: verdict STALE + dev-sync REFUSED**; **(113)**'s copy (operator-blocked); then whatever the newest bullet names. **Next run**: **(93)**/**(97)(a)** if the investor has answered, otherwise the reviewer-gated promote of those two already-committed `app/src/php` fixes (dev first, prod behind the verdict) — that is the red the dashboards still show after this step.

- **CLOSE PROTOCOL**: this entry appended **before** the commit that carries it (rule 1); the commit uses the **named paths only** (`app/src/go/cmd/gladex/commands/root_test.go`, `CHANGELOG.md`, `agent-logs/PROGRESS.md`), never `git add -A` (shared tree, concurrent identity sessions); if a second commit carries the closing measurements, this entry is **re-appended before it** (rule 2); after each commit `git status --porcelain` must **not** list `agent-logs/PROGRESS.md` (rule 3).
EOF
git status --porcelain; echo "--- appended"; tail -3 agent-logs/PROGRESS.md | head -1
M CHANGELOG.md
 M agent-logs/PROGRESS.md
 M app/src/go/cmd/gladex/commands/root_test.go
--- appended
- **Next-candidate queued, not actioned**: **(93)**/**(97)(a)** fire the moment the investor answers (Marco Steiner hire approval — 0 unread at this close); **(r1)** *a failed shift must not read green* — blocked on `tests/test_identity_wrapper.sh` case2 pinning `exit 0`, so the next owner must change wrapper **and** test together, or accept a reader-side check instead of exit-code propagation; **(r2)** *the path-scoped auto-commit cannot tell who changed a file* (measured on `2a7bc39`); the two repo-newer-than-env PHP fixes (`2803360` footer version constant, `30a6574` mailbox `:focus-visible`) still awaiting a reviewer-gated promote — `source-sync-check` reads **DRIFT 4 file(s)** (dev and prod each) and `promote-gates` reads **REFUSED: verdict STALE + dev-sync REFUSED**; **(113)**'s copy (operator-blocked); then whatever the newest bullet names. **Next run**: **(93)**/**(97)(a)** if the investor has answered, otherwise the reviewer-gated promote of those two already-committed `app/src/php` fixes (dev first, prod behind the verdict) — that is the red the dashboards still show after this step.
> build · mimo-v2.6-flash-free
$ cd /data/repo && git add app/src/go/cmd/gladex/commands/root_test.go CHANGELOG.md agent-logs/PROGRESS.md && git commit -m "fix/go: TestInitCommandHelp left cobra's parsed help=true on the shared initCmd, so every later init ran the help path and initialised nothing — restore the flag, go-tests FAIL -> 220/0/2 ok [0.4.200]" 2>&1 | tail -12; echo "=== status after commit #1"; git status --porcelain; echo "(empty above = PROGRESS not listed)"; git log --oneline -2
[main c5d1e81] fix/go: TestInitCommandHelp left cobra's parsed help=true on the shared initCmd, so every later init ran the help path and initialised nothing — restore the flag, go-tests FAIL -> 220/0/2 ok [0.4.200]
 3 files changed, 51 insertions(+), 1 deletion(-)
=== status after commit #1
(empty above = PROGRESS not listed)
c5d1e81 fix/go: TestInitCommandHelp left cobra's parsed help=true on the shared initCmd, so every later init ran the help path and initialised nothing — restore the flag, go-tests FAIL -> 220/0/2 ok [0.4.200]
dd8cf0d identity sofia shift 2026-10-04T11:55Z model=opencode/ling-3.1-flash-free
> build · mimo-v2.6-flash-free
$ cd /data/repo && git remote -v; timeout 60 git push origin main 2>&1 | tail -8; echo "push rc=$?"; git status -sb | head -2
origin	git://git.gladex.de/gladex.git (fetch)
origin	git://git.gladex.de/gladex.git (push)
To git://git.gladex.de/gladex.git
   ed006cf..c5d1e81  main -> main
push rc=0
## main...origin/main
> build · mimo-v2.6-flash-free
$ cd /data/repo && ./tools/queue-source-check; echo "qsc=$?"; ./tools/system-status 2>&1 | grep -E "go-tests|git-tree|red-watch|promote-gates|queue-source|Overall"; echo "sys=$?"
queue-source-check: OK - one queue: [0.4.200] pointer-only, 111 item line(s) frozen across 156 section(s), 175 PROGRESS bullet(s), 1 path token(s)
qsc=0
  git-tree                  [OK] clean
  red-watch                 [WARN] red, failed=7, since 2026-10-04T06:46:46Z, 10m old; FAIL A3 tree clean AND in sync with origin/main (kind=is key=git want=## main...origin/main) ;; FAIL A12 system-status exits 0 (kind=rc key=sys want=0) ;; FAIL A13 overall healthy (kind=contains key=sys want=Overall: ALL SYSTEMS HEALTHY) ;; FAIL A16 system-status json exits 0 (kind=rc key=sysj want=0) ;; FAIL A17 json channel says overall ok (kind=contains key=sysj want=overall:ok) ;; FAIL A18 jso
  queue-source              [OK] one queue: [0.4.200] pointer-only, 111 item line(s) frozen across 156 section(s), 175 PROGRESS bullet(s), 1 path token(s)
  go-tests                  [OK] passing (worktree)
  promote-gates             [WARN] not promotable since 2026-10-03T15:04:23Z (1417m ago): verdict REFUSED: verdict VERDICT-20261003T151200-promote-re-review.md is STALE (promoted source [app/src/php, examples/workflows] changed 59367s after it \u2014 re-review required) | dev-sync REFUSED: dev tree differs from the repo in 2 file(s): src/php/app.php (differs), src/php/mailbox.php (differs) \u2014 this promotion copies REPO -> prod, so that w
Overall: ALL SYSTEMS HEALTHY
sys=0
> build · mimo-v2.6-flash-free
$ cd /data/repo && time timeout 900 ./tools/red-watch 2>&1 | tail -20; echo "redwatch rc=$?"
red-watch: state=green monitor_exit=0 passed=29 failed=0 alert=RECOVERED
  log=/data/agent-logs/red-watch-20261004.log
  alerts=/data/agent-logs/red-watch-ALERTS.log
redwatch rc=0

real	1m41.043s
user	1m35.750s
sys	0m33.890s
> build · mimo-v2.6-flash-free
$ cd /data/repo && tail -3 /data/agent-logs/red-watch-ALERTS.log; echo "=== dated log tail"; tail -3 /data/agent-logs/red-watch-20261004.log; echo "=== system-status red-watch row"; ./tools/system-status 2>&1 | grep -E "red-watch|Overall"; echo "=== tree"; git status --porcelain; git log --oneline -3; git status -sb | head -1
2026-10-04T14:15:01Z RED-SET since=1791096406 monitor_exit=1 passed=23 failed=6 fails="FAIL A3 tree clean AND in sync with origin/main (kind=is key=git want=## main...origin/main) | FAIL A12 system-status exits 0 (kind=rc key=sys want=0) | FAIL A16 system-status json exits 0 (kind=rc key=sysj want=0) | FAIL A17 json channel says overall ok (kind=contains key=sysj want='overall':'ok') | FAIL A18 json channel says zero errors (kind=contains key=sysj want='errors':0) | FAIL A28 no undocumented code commit since the last CHANGELOG commit (kind=rc key=docs want=0)"
2026-10-04T14:30:01Z RED-SET since=1791096406 monitor_exit=1 passed=22 failed=7 fails="FAIL A3 tree clean AND in sync with origin/main (kind=is key=git want=## main...origin/main) | FAIL A12 system-status exits 0 (kind=rc key=sys want=0) | FAIL A13 overall healthy (kind=contains key=sys want=Overall: ALL SYSTEMS HEALTHY) | FAIL A16 system-status json exits 0 (kind=rc key=sysj want=0) | FAIL A17 json channel says overall ok (kind=contains key=sysj want='overall':'ok') | FAIL A18 json channel says zero errors (kind=contains key=sysj want='errors':0) | FAIL A28 no undocumented code commit since the last CHANGELOG commit (kind=rc key=docs want=0)"
2026-10-04T14:41:36Z RECOVERED after=28591s previously_failed=7
=== dated log tail
2026-10-04T14:15:01Z state=red monitor_exit=1 passed=23 failed=6 alert=RED-SET fails="FAIL A3 tree clean AND in sync with origin/main (kind=is key=git want=## main...origin/main) | FAIL A12 system-status exits 0 (kind=rc key=sys want=0) | FAIL A16 system-status json exits 0 (kind=rc key=sysj want=0) | FAIL A17 json channel says overall ok (kind=contains key=sysj want='overall':'ok') | FAIL A18 json channel says zero errors (kind=contains key=sysj want='errors':0) | FAIL A28 no undo"
2026-10-04T14:30:01Z state=red monitor_exit=1 passed=22 failed=7 alert=RED-SET fails="FAIL A3 tree clean AND in sync with origin/main (kind=is key=git want=## main...origin/main) | FAIL A12 system-status exits 0 (kind=rc key=sys want=0) | FAIL A13 overall healthy (kind=contains key=sys want=Overall: ALL SYSTEMS HEALTHY) | FAIL A16 system-status json exits 0 (kind=rc key=sysj want=0) | FAIL A17 json channel says overall ok (kind=contains key=sysj want='overall':'ok') | FAIL A18 json"
2026-10-04T14:41:36Z state=green monitor_exit=0 passed=29 failed=0 alert=RECOVERED fails=""
=== system-status red-watch row
  red-watch                 [OK] green, 2m old (updated 2026-10-04T14:41:36Z)
Overall: ALL SYSTEMS HEALTHY
=== tree
c5d1e81 fix/go: TestInitCommandHelp left cobra's parsed help=true on the shared initCmd, so every later init ran the help path and initialised nothing — restore the flag, go-tests FAIL -> 220/0/2 ok [0.4.200]
dd8cf0d identity sofia shift 2026-10-04T11:55Z model=opencode/ling-3.1-flash-free
610693b identity dispatcher shift 2026-10-04T11:51Z model=opencode/nemotron-3-ultra-free
## main...origin/main
> build · mimo-v2.6-flash-free
$ cd /data/repo && cat >> agent-logs/PROGRESS.md <<'EOF'

- **CLOSE MEASUREMENTS (this run's second append, written BEFORE the commit that carries it — rules 2 and 3).** Commit **`c5d1e81`** (3 files: `root_test.go`, `CHANGELOG.md`, this file) landed and was **pushed**: `git push origin main` → `ed006cf..c5d1e81 main -> main`, rc 0, so `git status -sb` now reads **`## main...origin/main`** — the exact string `A3` demands, i.e. the standing "push every run after commit" order is back in force after 11 unpushed commits. `./tools/red-watch` run manually at **14:41:36Z**: **`state=green monitor_exit=0 passed=29 failed=0 alert=RECOVERED`**, `previously_failed=7`, `after=28591s` — the monitor had been red since **06:46:46Z** (~7.9 h), and the last RED-SET line named exactly the seven this step cleared (**A3** by the push; **A12/A13/A16/A17/A18** by the `go-tests` fix; **A28** by committing `CHANGELOG.md` in the same commit as the code it documents). `./tools/system-status` re-read after: `red-watch [OK] green`, `git-tree [OK] clean`, `go-tests [OK] passing`, `queue-source [OK] … [0.4.200] … 1 path token(s)`, **`Overall: ALL SYSTEMS HEALTHY`**; `./tools/queue-source-check` → **exit 0** naming **[0.4.200]**; `./tools/repo-lint --format json` → **exit 0, `failures []`**. Still red/warn and **deliberately untouched**: `promote-gates [WARN]` (verdict STALE + `dev-sync REFUSED` — the two already-committed `app/src/php` fixes, queued for next run behind the reviewer gate). STEP 0 re-read at this close: unread **0 dev / 0 prod**, `inbox-status` **exit 0**, `INBOX.md` **79/79/0** — no reply written, thread untouched. `git status --porcelain` must not list `agent-logs/PROGRESS.md` after this commit (rule 3), and the tree stays in sync with `origin/main`.
EOF
git add agent-logs/PROGRESS.md && git commit -m "docs: run closing measurements — push ed006cf..c5d1e81, red-watch RECOVERED (7->0), system-status ALL SYSTEMS HEALTHY [0.4.200]" 2>&1 | tail -4; echo "=== status after commit #2"; git status --porcelain; echo "(empty = PROGRESS not listed)"; timeout 60 git push origin main 2>&1 | tail -3; git status -sb | head -1; ./tools/queue-source-check; ./tools/inbox-status | tail -3
[main 1331477] docs: run closing measurements — push ed006cf..c5d1e81, red-watch RECOVERED (7->0), system-status ALL SYSTEMS HEALTHY [0.4.200]
 1 file changed, 2 insertions(+)
=== status after commit #2
(empty = PROGRESS not listed)
To git://git.gladex.de/gladex.git
   c5d1e81..1331477  main -> main
## main...origin/main
queue-source-check: OK - one queue: [0.4.200] pointer-only, 111 item line(s) frozen across 156 section(s), 175 PROGRESS bullet(s), 1 path token(s)
  INBOX.md        : 79 entries, 79 handled, 0 open

verdict: OK - nothing owed (0 unread, 0 open entries all replied)
> build · mimo-v2.6-flash-free
Run complete and closed cleanly. Summary:

## STEP 0 (done first, nothing owed)
- `investor_to_agent WHERE read=0` → **0 dev / 0 prod** (both DBs read directly)
- `./tools/inbox-status` → **exit 0**, "OK - nothing owed (0 unread, 0 open entries all replied)"; `INBOX.md` **79/79 handled, 0 open**; last reply dev 143 / prod 108 → **no reply written, thread untouched**

## The step: cleared the `go-tests` red at its source
The queue handed me "(93)/(97)(a) if the investor answered, otherwise wait for the shifts". Investor hasn't answered (Marco Steiner hire still `proposed`), and all 7 `identity-run@*` units read `inactive (dead)` with timers active — so I took the red the dashboards were showing: `system-status` → `go-tests [FAIL]` + `Overall: 1 CHECK(S) FAILED`.

**Root cause (bisected, not guessed):** `TestStatusUsesConfigPort` failed only in full-package runs. Pairing it with `TestInitCommandHelp` reproduced it in 0.00 s. From `cobra@v1.8.1` source: `execute()` reads the *parsed* `help` flag value and returns `flag.ErrHelp`, while `InitDefaultHelpFlag()` only creates the flag — so `init --help` left `initCmd`'s `help=true` for the whole process, every later `init` took the help path, and `ExecuteC` turned that into a printed help screen + **nil** error, i.e. `init` reported success having created nothing.

**Fix (one file):** `defer initCmd.Flags().Set("help", "false")` in `TestInitCommandHelp`, plus closing the file's pre-existing missing trailing newline (`gofmt -l` clean).

## Measured results
| Check | Before | After |
|---|---|---|
| `go test ./... -count=1 -short` | FAIL `cmd/gladex/commands` | **ok** both packages, **220 passed / 0 failed / 2 skipped** |
| `system-status` Overall | 1 CHECK FAILED | **ALL SYSTEMS HEALTHY** |
| `red-watch` | red since 06:46Z, 7 failures | **`state=green passed=29 failed=0 alert=RECOVERED`** (after 28,591 s) |
| `git status -sb` | main ahead 11 | **`## main...origin/main`** (pushed, A3 green) |

Commits: `c5d1e81` (fix + `[0.4.200]` + PROGRESS entry) and `1331477` (closing measurements) — both pushed, PROGRESS appended **before** each commit, `git status --porcelain` empty at close.

Spend **0.00**, free `*-free` models only, no secrets, zero DNS writes, no service restarts, no reviewer gate needed (no `app/src/php` touched — prod stays 0.4.28).

**Queued next run:** (93)/(97)(a) if the investor answers; otherwise the reviewer-gated promote of the two already-committed PHP fixes (`2803360` footer version, `30a6574` focus-visible) — `promote-gates` still reads WARN (verdict STALE + dev-sync DRIFT), the only red left standing.
exit=0

Select another run log from the list above. Only files matching run-YYYYMMDD-HHMMSS-N.log are readable.

App log tail — prod-8001.log (last 60 lines)
[Sun Oct  4 17:13:36 2026] 127.0.0.1:46018 Accepted
[Sun Oct  4 17:13:36 2026] 127.0.0.1:46018 Closing
[Sun Oct  4 17:13:36 2026] 127.0.0.1:46032 Accepted
[Sun Oct  4 17:13:36 2026] 127.0.0.1:46032 Closing
[Sun Oct  4 17:13:36 2026] 127.0.0.1:46038 Accepted
[Sun Oct  4 17:13:36 2026] 127.0.0.1:46038 Closing
[Sun Oct  4 17:13:36 2026] 127.0.0.1:46052 Accepted
[Sun Oct  4 17:13:36 2026] 127.0.0.1:46052 Closing
[Sun Oct  4 17:13:36 2026] 127.0.0.1:46060 Accepted
[Sun Oct  4 17:13:36 2026] 127.0.0.1:46060 Closing
[Sun Oct  4 17:13:36 2026] 127.0.0.1:46072 Accepted
[Sun Oct  4 17:13:36 2026] 127.0.0.1:46072 Closing
[Sun Oct  4 17:13:36 2026] 127.0.0.1:46076 Accepted
[Sun Oct  4 17:13:37 2026] 127.0.0.1:46076 Closing
[Sun Oct  4 17:13:37 2026] 127.0.0.1:46082 Accepted
[Sun Oct  4 17:13:37 2026] 127.0.0.1:46082 Closing
[Sun Oct  4 17:14:10 2026] 127.0.0.1:41214 Accepted
[Sun Oct  4 17:14:10 2026] 127.0.0.1:41214 Closing
[Sun Oct  4 17:14:22 2026] 127.0.0.1:57764 Accepted
[Sun Oct  4 17:14:22 2026] 127.0.0.1:57764 Closing
[Sun Oct  4 17:14:22 2026] 127.0.0.1:57778 Accepted
[Sun Oct  4 17:14:22 2026] 127.0.0.1:57778 Closing
[Sun Oct  4 17:14:22 2026] 127.0.0.1:57780 Accepted
[Sun Oct  4 17:14:22 2026] 127.0.0.1:57780 Closing
[Sun Oct  4 17:14:22 2026] 127.0.0.1:57788 Accepted
[Sun Oct  4 17:14:22 2026] 127.0.0.1:57788 Closing
[Sun Oct  4 17:14:22 2026] 127.0.0.1:57802 Accepted
[Sun Oct  4 17:14:22 2026] 127.0.0.1:57802 Closing
[Sun Oct  4 17:14:22 2026] 127.0.0.1:57808 Accepted
[Sun Oct  4 17:14:22 2026] 127.0.0.1:57808 Closing
[Sun Oct  4 17:14:22 2026] 127.0.0.1:57824 Accepted
[Sun Oct  4 17:14:23 2026] 127.0.0.1:57824 Closing
[Sun Oct  4 17:14:23 2026] 127.0.0.1:57836 Accepted
[Sun Oct  4 17:14:23 2026] 127.0.0.1:57836 Closing
[Sun Oct  4 17:14:23 2026] 127.0.0.1:57848 Accepted
[Sun Oct  4 17:14:23 2026] 127.0.0.1:57848 Closing
[Sun Oct  4 17:14:23 2026] 127.0.0.1:57860 Accepted
[Sun Oct  4 17:14:23 2026] 127.0.0.1:57860 Closing
[Sun Oct  4 17:15:10 2026] 127.0.0.1:40988 Accepted
[Sun Oct  4 17:15:10 2026] 127.0.0.1:40988 Closing
[Sun Oct  4 17:15:10 2026] 127.0.0.1:41004 Accepted
[Sun Oct  4 17:15:10 2026] 127.0.0.1:41004 Closing
[Sun Oct  4 17:15:10 2026] 127.0.0.1:41016 Accepted
[Sun Oct  4 17:15:10 2026] 127.0.0.1:41016 Closing
[Sun Oct  4 17:15:10 2026] 127.0.0.1:41018 Accepted
[Sun Oct  4 17:15:10 2026] 127.0.0.1:41018 Closing
[Sun Oct  4 17:15:10 2026] 127.0.0.1:41034 Accepted
[Sun Oct  4 17:15:10 2026] 127.0.0.1:41034 Closing
[Sun Oct  4 17:15:10 2026] 127.0.0.1:41036 Accepted
[Sun Oct  4 17:15:10 2026] 127.0.0.1:41036 Closing
[Sun Oct  4 17:15:10 2026] 127.0.0.1:41048 Accepted
[Sun Oct  4 17:15:10 2026] 127.0.0.1:41048 Closing
[Sun Oct  4 17:15:10 2026] 127.0.0.1:41062 Accepted
[Sun Oct  4 17:15:10 2026] 127.0.0.1:41062 Closing
[Sun Oct  4 17:15:10 2026] 127.0.0.1:41076 Accepted
[Sun Oct  4 17:15:10 2026] 127.0.0.1:41076 Closing
[Sun Oct  4 17:15:10 2026] 127.0.0.1:41084 Accepted
[Sun Oct  4 17:15:10 2026] 127.0.0.1:41084 Closing
[Sun Oct  4 17:15:11 2026] 127.0.0.1:41088 Accepted

Generated 2026-10-04 15:15:11 UTC · Gladex.de