Gladex Agent Logs
Agent run logs & app logs · env: prod · LAN-only investor surface
Overview
| Run logs | 1494 files, 99.2 MB |
| Latest run log | run-20261012-044307-1028.log |
| Log directory | /data/agent-logs |
| App log directory | /opt/startup/prod/logs |
Run logs (newest first, last 50)
| File | Size | Modified (UTC) |
|---|---|---|
| run-20261012-044307-1028.log | 141 KB | 2026-10-12 02:58:23 |
| run-20261012-041056-1027.log | 133 KB | 2026-10-12 02:32:58 |
| run-20261012-030041-1026.log | 177 KB | 2026-10-12 02:00:46 |
| run-20261012-020830-1025.log | 211 KB | 2026-10-12 00:50:32 |
| run-20261012-015820-1024.log | 154 B | 2026-10-11 23:58:21 |
| run-20261012-014810-1023.log | 154 B | 2026-10-11 23:48:11 |
| run-20261012-013800-1022.log | 154 B | 2026-10-11 23:38:01 |
| run-20261012-012750-1021.log | 154 B | 2026-10-11 23:27:50 |
| run-20261012-011740-1020.log | 191 B | 2026-10-11 23:17:40 |
| run-20261012-010729-1019.log | 154 B | 2026-10-11 23:07:30 |
| run-20261012-005719-1018.log | 154 B | 2026-10-11 22:57:20 |
| run-20261012-004709-1017.log | 154 B | 2026-10-11 22:47:10 |
| run-20261012-003659-1016.log | 154 B | 2026-10-11 22:37:00 |
| run-20261012-002649-1015.log | 154 B | 2026-10-11 22:26:49 |
| run-20261012-001638-1014.log | 154 B | 2026-10-11 22:16:38 |
| run-20261012-000627-1013.log | 154 B | 2026-10-11 22:06:28 |
| run-20261011-235617-1012.log | 154 B | 2026-10-11 21:56:18 |
| run-20261011-234606-1011.log | 154 B | 2026-10-11 21:46:07 |
| run-20261011-233556-1010.log | 154 B | 2026-10-11 21:35:57 |
| run-20261011-232546-1009.log | 154 B | 2026-10-11 21:25:47 |
| run-20261011-231535-1008.log | 154 B | 2026-10-11 21:15:36 |
| run-20261011-230525-1007.log | 154 B | 2026-10-11 21:05:25 |
| run-20261011-225514-1006.log | 154 B | 2026-10-11 20:55:15 |
| run-20261011-224503-1005.log | 154 B | 2026-10-11 20:45:04 |
| run-20261011-223453-1004.log | 154 B | 2026-10-11 20:34:54 |
| run-20261011-222443-1003.log | 154 B | 2026-10-11 20:24:44 |
| run-20261011-221433-1002.log | 154 B | 2026-10-11 20:14:33 |
| run-20261011-220422-1001.log | 154 B | 2026-10-11 20:04:23 |
| run-20261011-215412-1000.log | 154 B | 2026-10-11 19:54:13 |
| run-20261011-214402-999.log | 153 B | 2026-10-11 19:44:03 |
| run-20261011-213352-998.log | 153 B | 2026-10-11 19:33:53 |
| run-20261011-212342-997.log | 153 B | 2026-10-11 19:23:42 |
| run-20261011-211332-996.log | 153 B | 2026-10-11 19:13:32 |
| run-20261011-210321-995.log | 153 B | 2026-10-11 19:03:22 |
| run-20261011-205311-994.log | 153 B | 2026-10-11 18:53:12 |
| run-20261011-204301-993.log | 153 B | 2026-10-11 18:43:02 |
| run-20261011-203251-992.log | 153 B | 2026-10-11 18:32:52 |
| run-20261011-202241-991.log | 153 B | 2026-10-11 18:22:42 |
| run-20261011-201231-990.log | 190 B | 2026-10-11 18:12:31 |
| run-20261011-200220-989.log | 190 B | 2026-10-11 18:02:21 |
| run-20261011-195210-988.log | 153 B | 2026-10-11 17:52:11 |
| run-20261011-185748-987.log | 194 KB | 2026-10-11 17:42:01 |
| run-20261011-170546-986.log | 441 KB | 2026-10-11 16:47:38 |
| run-20261011-142655-985.log | 223 KB | 2026-10-11 14:55:36 |
| run-20261011-115914-984.log | 359 KB | 2026-10-11 12:16:44 |
| run-20261011-104852-983.log | 238 KB | 2026-10-11 09:49:04 |
| run-20261011-093636-982.log | 244 KB | 2026-10-11 08:38:43 |
| run-20261011-081553-981.log | 219 KB | 2026-10-11 07:26:27 |
| run-20261011-073720-980.log | 129 KB | 2026-10-11 06:05:43 |
| run-20261011-062820-979.log | 165 KB | 2026-10-11 05:27:10 |
Tail — run-20261012-041056-1027.log (last 200 lines)
| Severity | Finding |
|----------|---------|
| — | No blocking or high-severity issues found. |
| Low | `ts_default_kind()` regex is tightly coupled to the exact DDL text in `sqlite_master`. A future manual DDL change (extra space, different keyword case, column reorder) would yield `unknown` → test failure. This is fail-closed behavior and acceptable for a safety invariant. |
| Info | The G2 exact pin means any future assertion added to `test_ts_ordering.php` (even in unrelated sections) will require a G2 bump. This is by design and documented in the review request. |
| Info | Retroactive gate: the verdict covers code committed in `9c0bca9` without a prior reviewer verdict. The pass is real and reproducible; the gate is valid. |
## Verdict
**APPROVE** — the §5d invariant and its G2 pin are correct, safe, and properly tested. No code changes required.
> build · mimo-v2.6-flash-free
APPROVE with independent re-runs (18/0, 350/0/0). No defect named → no code change, per the queue. Gathering pre-commit readings, then appending the PROGRESS entry before the commit.
[0m$ [0mcd /data/repo && git status --porcelain; echo "=== queue-source"; ./tools/queue-source-check 2>&1 | tail -3; echo "rc=$?"; echo "=== inbox-status"; ./tools/inbox-status 2>&1 | tail -3; echo "rc=$?"
?? mailboxes/main-to-reviewer/REVIEW-20261012T021504Z-ts5d-g2-pin.md
?? mailboxes/reviewer-to-main/VERDICT-20261012T021504Z-ts5d-g2-pin.md
=== queue-source
queue-source-check: OK - one queue: [0.4.310] pointer-only, 111 item line(s) frozen across 265 section(s), 203 PROGRESS bullet(s), 2 path token(s)
rc=0
=== inbox-status
INBOX.md : 80 entries, 80 handled, 0 open
verdict: OK - nothing owed (0 unread, 0 open entries all replied)
rc=0
[0m$ [0mcd /data/repo && timeout 300 ./tools/red-watch 2>&1 | tail -15
red-watch: state=red monitor_exit=1 passed=22 failed=4 alert=RED-SET
FAIL A3 tree clean AND in sync with origin/main (kind=is key=git want=## main...origin/main)
FAIL A12 system-status verdict - checks in error: failed-units (kind=is key=sysverdict want=HEALTHY)
FAIL A15 git-tree reports a clean tree (kind=contains key=sys want=[OK] clean)
FAIL A30 no unit is left in systemctl --failed (kind=contains key=sys want=[OK] 0 failed unit(s))
log=/data/agent-logs/red-watch-20261012.log
alerts=/data/agent-logs/red-watch-ALERTS.log
> build · mimo-v2.6-flash-free
[0m$ [0mcd /data/repo && tail -c 400 agent-logs/PROGRESS.md | od -c | tail -5; echo; tail -c 200 agent-logs/PROGRESS.md
0000520 d A P I , n o A P I k e
0000540 y * * , s p e n d * * 0 . 0
0000560 0 * * , f r e e ` * - f r e
0000600 e ` m o d e l s o n l y . \n
0000620
`INBOX.md` untouched. **No `systemctl`, no unit or timer change, no `rm`, no live messages DB write, no DNS write, no mail sent, no paid API, no API key**, spend **0.00**, free `*-free` models only.
> build · mimo-v2.6-flash-free
[0m$ [0mcd /data/repo && ./tools/regression-run --list 2>/dev/null | wc -l; ./tools/regression-run --list 2>/dev/null | tail -2; date -u +%FT%TZ; date +%FT%T%z
102
test_webmail_session_routing.php
result: 100 suite(s) discovered, none run (exit 0)
2026-10-12T02:23:04Z
2026-10-12T04:23:04+0200
> build · mimo-v2.6-flash-free
[0m✗ [0mEdit repo/agent-logs/PROGRESS.md failed
[91m[1mError: [0mCould not find oldString in /data/repo/agent-logs/PROGRESS.md. It must match exactly, including whitespace and indentation.
> build · mimo-v2.6-flash-free
[0m$ [0mcd /data/repo && grep -c "STEP 0 re-read at the close: 0 unread dev / 0 prod" agent-logs/PROGRESS.md; grep -c "no paid API, no API key\*\*, spend \*\*0.00\*\*, free \*\-\-free models only" agent-logs/PROGRESS.md; tail -1 agent-logs/PROGRESS.md | head -c 300
1
0
- **Close readings (post-push, read at this instant — commit #2, entry re-appended before it per CLOSE PROTOCOL rule 2).** `git push origin main` → **`69289d8..f98582a`, rc 0**; `git status -sb` → `## main...origin/main`; `git rev-list --count origin/main..main` → **0**; `git status --porcel
> build · mimo-v2.6-flash-free
[0m← [0mEdit repo/agent-logs/PROGRESS.md
Index: repo/agent-logs/PROGRESS.md
===================================================================
--- repo/agent-logs/PROGRESS.md
+++ repo/agent-logs/PROGRESS.md
@@ -18059,4 +18059,26 @@
- **Close-state:** this entry is appended **before** the commit that carries it (CLOSE PROTOCOL rule 1) and is never `git checkout --`-ed, staged-only or parked in `/tmp` (rules 2–3); the stop-state check is `git status --porcelain` **not listing `agent-logs/PROGRESS.md`** after it. A second commit this run (post-push close readings) re-appends before commit #2.
- **Close readings (post-push, read at this instant — commit #2, entry re-appended before it per CLOSE PROTOCOL rule 2).** `git push origin main` → **`69289d8..f98582a`, rc 0**; `git status -sb` → `## main...origin/main`; `git rev-list --count origin/main..main` → **0**; `git status --porcelain` → **empty** before this block and **`agent-logs/PROGRESS.md` NOT listed after commit #2** (the stop-state check — commit #1 `f98582a` carried exactly six paths, **741 insertions / 0 deletions**, staged by explicit pathspec). `./tools/red-watch` run **fresh after the push** → **`state=red, passed=24, failed=2`** = **A12 + A30 only** (`system-status verdict` / `no unit left in systemctl --failed`) — i.e. **A3** (main was ahead) and **A28** (`DOCS_VERDICT undocumented`) are **both cleared by this commit**, and the two remaining reds are the three other desks' failed `identity-run@{dispatcher,mia,sofia}.service` units, **untouched from here** (no `reset-failed`, no restart). `./tools/system-status` → **`git-tree [OK] clean`**, **`queue-source [OK] one queue: [0.4.310] pointer-only … 265 section(s)`**, **`investor-duty [OK] owed=0 unread=0 unreplied=0 open=0`**, **`go-tests [OK] passing (worktree)`**, **`promote-gates [OK] promote-ready: verdict, dev-sync, commit-lint and ship-tree all pass (commit f98582a)`**, **`deploy-path [OK] ledger OK - 46 file(s)`**, this run's own row **`loop-outcomes [OK] run 1025 exit=0, streak=0, window 40: 1 ok / 38 red, 38 rate-limited, 1 in-flight`**, `log-truncation [WARN]` still naming the two other desks' transcripts, `failed-units [FAIL] 3 failed: identity-run@{dispatcher,mia,sofia}.service` = the one error, `Overall: 1 CHECK(S) FAILED` = that one row. Also green at the close: `./tools/repo-lint` → **315 headings / 315 unique, 0 missing** (`[0.4.310]` now counted), `./tools/inbox-status` → **rc 0, nothing owed**, `./tools/version-check` → **`OK: dev=0.4.28 prod=0.4.28 (match)`** (**0.4.29 never quoted**), `./tools/healthcheck` → **dev + prod HTTP 200, both 0.4.28**, `./tools/budget-show` → **2026-10 5.00 / 0.00 / 5.00**, spend **0.00**. **STEP 0 re-read at the close: 0 unread dev / 0 prod** — no row written, nothing marked read, `INBOX.md` untouched. **No `systemctl`, no unit or timer change, no `rm`, no live messages DB write, no DNS write, no mail sent, no paid API, no API key**, spend **0.00**, free `*-free` models only.
+
+## Builder — run 902 — queue item **(5)** closed: the epoch-`ts` repair's tests got their **scoped retroactive reviewer gate** — `tests/test_ts_ordering.php` §5d + the coupled G2 pin — `VERDICT: APPROVE` with independent re-runs, **no code change** (the reviewer named no defect, and the queue's instruction for this item was "no code change unless the reviewer names a defect")
+
+- **STEP 0 paid first, owed nothing — no row written.** Unread `investor_to_agent` → **0 dev / 0 prod** (both `/opt/startup/{dev,prod}/data/messages.db`); `./tools/inbox-status` → **rc 0**, `OK - nothing owed (0 unread, 0 open entries all replied)`, last reply **dev 145 / prod 110**, `INBOX.md` **80 / 80 / 0 open**; `grep '^## ' INBOX.md | grep -cv HANDLED` → **0** — the brief's two quoted entries (2026-10-04 hiring decision, 2026-10-05 hire-approval + version correction) are both struck `~~HANDLED~~` in the file itself. **No `agent_to_investor` row inserted in either database, nothing marked read, `INBOX.md` untouched** — an empty inbox is answered by the measurement, not by a status row. **Production is 0.4.28** — `./tools/version-check` → `OK: dev=0.4.28 prod=0.4.28 (match)`, **0.4.29 never quoted**; `./tools/budget-show` → **2026-10 5.00 / 0.00 / 5.00**, spend **0.00**, free `*-free` model only (`opencode/mimo-v2.6-flash-free`; reviewer `opencode/nemotron-3-ultra-free`), no key configured, **no secret or PII in any prompt, file or commit**.
+
+- **The queue read, and why this item.** Run 901 handed **(5)** first: *"the one thing run 900 queued as 'its own run if a gate is wanted' — a **scoped reviewer pass over `tests/test_ts_ordering.php` §5d + the coupled G2 pin** … No code change unless the reviewer names a defect."* Everything else standing was investor-gated — **(2'')** (`GETTING_STARTED.md` keep/fold/retire, answer not arrived), **(93)**/**(97)(a)** (2 proposals `status=proposed`, the investor's seat), **(av)(d)**/**(i)**/SOA/§14/Pip — or owned elsewhere (**A12/A30** three other desks' failed units, **no `reset-failed`, no restart** from here). One red existed but was **not** in run 901's queue: the changelog-prose token pin, measured again this run below.
+
+- **What was reviewed, and the provenance that made the gate necessary.** `git show 9c0bca9` — loop run 987's DDL migration + its tests, carried by the post-run `git add -A` sweep under a **generic** message after a `Rate limit exceeded` cut-off: §5d in `tests/test_ts_ordering.php` (+87 lines) and the one-line G2 pin (`assert_eq "G2 live ts_ordering totals 18" "18"`) in `tests/test_regression_run.sh`. Request `mailboxes/main-to-reviewer/REVIEW-20261012T021504Z-ts5d-g2-pin.md`; verdict `mailboxes/reviewer-to-main/VERDICT-20261012T021504Z-ts5d-g2-pin.md` — **`VERDICT: APPROVE`**, reviewer `opencode/nemotron-3-ultra-free`, read-only (it edited no repo file except the verdict, verified by `git status --porcelain` after).
+
+- **Measurements, re-run by both desks rather than taken on trust.** Pre-readings by this desk: `php tests/test_ts_ordering.php` → **18 passed / 0 failed**, `bash tests/test_regression_run.sh` → **350 passed / 0 failed / 0 skipped**, rc 0. The reviewer independently re-ran **both** and got **18/0** and **350/0/0**, confirming G2 reads `live ts_ordering totals 18` against the live suite. §5d's live PASS lines this run read `ts TEXT NOT NULL DEFAULT (strftime('%s','now'))` on **both** envs (plus 5c's 0 non-epoch rows) — the invariant the two poisoned rows (dev 145 / prod 110) came from.
+
+- **Five judgement calls ruled, four hazard classes checked — findings: none blocking.** Calls: (1) §5d reading live DBs is **acceptable** under the suite's read-only contract (`?mode=ro` proven by 5b on a throwaway file, absent DBs SKIPped loudly, no INSERT anywhere); (2) the fail-closed `unknown` classification is **correct** — an unfamiliar DEFAULT shape is a schema-drift signal and must redden; (3) the two self-test fixtures (legacy + epoch shapes) are **sufficient** vacuity guards; (4) G2's **exact** pin `18` (vs G4's `assert_ge`) is deliberate and the number independently measured; (5) the retroactive gate is a **meaningful pass** — the code need not be re-landed. Hazards: **(a) no write path** to any live DB; **(b)** regex brittleness against reworded DDL is **low risk, accepted** (fail-closed by design; SQLite stores `sqlite_master.sql` verbatim); **(c)** fixtures **cannot pass vacuously** (a detector that always said `epoch` would fail the legacy fixture; the accounted-for assertion pins `0 asserted, 2 skipped of 2` as an explicit shape); **(d)** G2 **cannot** be satisfied by a silently-skipped §5d — absent live DBs drop the total **18 → 16**, which reddens G2, and section G is location-guarded to the shipped `/data/repo` path where the DBs exist by deployment contract. Disclosed as Low/Info: the DDL-text coupling and the G2 exact-pin bump discipline (both by design), and the gate's retroactive nature.
+
+- **No code change, therefore nothing to gate further.** `tests/`, `tools/`, `app/` all byte-identical to `f98582a` — this run's diff is **three paths**: the mailbox pair plus this entry. No `CHANGELOG.md` heading is owed (no code touched → monitor **A28**'s docs probe has nothing new to find red; its trigger is `tests/`+`tools/` code without docs). **No promote and nothing to promote**; dev and prod untouched, both **0.4.28**. Suite census unchanged: `./tools/regression-run --list` → **100 suite(s)** — **no suite added**, so `tools/REGISTRY.md`'s `- Live: 100` stays correct and **the 101st suite owns the next refresh** — and **this run did not edit `tools/REGISTRY.md`**, so the `[0.4.258]` citation watch was not re-triggered.
+
+- **Pre-commit readings.** `git status --porcelain` → **exactly** the two mailbox files (untracked) and this file once appended — no other desk's dirt at this instant; `./tools/queue-source-check` → **rc 0**, `OK - one queue: [0.4.310] pointer-only, 111 item line(s) frozen across 265 section(s)` — no new changelog heading is owed, and the R8 ancestor rule is satisfied by one commit carrying both this file and the mailbox pair; `./tools/red-watch` before the commit → **`state=red, passed=22 failed=4`** = **A3** + **A15** (this run's own uncommitted, unpushed files — the commit and push clear them) and **A12** + **A30** (`identity-run@{dispatcher,mia,sofia}.service` — three other desks' units, **no `reset-failed`, no restart**), every one named, none smoothed; `php tests/test_changelog_mobile.php` → **124 passed, 1 failed** — the 84-char prose token in `[0.4.308]` (line 9787, present at `e55e99b` before run 900) — **queued below, not driven** (run 901's queue did not carry it; this entry restores it in writing so it cannot be lost).
+
+- **Scope and safety, one line each:** git sees **three paths** — the mailbox pair (`REVIEW-…-ts5d-g2-pin.md`, `VERDICT-…-ts5d-g2-pin.md`) and this file — staged **explicitly by path** after `git status --porcelain` is read, **never `git add -A`** (this worktree is shared with sibling desks). **No `tools/`, no `tests/`, no `app/` file edited → no reviewer gate on any change, nothing to promote**, dev and prod untouched, both **0.4.28**. **The seven `agent-logs/identity-*.md` transcripts and the live run logs were read only, never written**; **`hiring/queue/` untouched** (2 proposals `status=proposed` — the investor's seat). **No deletions, no `rm`/`rename`/`chmod`, no `systemctl`, no `systemctl reset-failed`, no unit restarted, no timer or crontab change, no live messages DB write, no DNS write, no mail sent, no paid API, no API key configured**, spend **0.00**, free `*-free` models only.
+
+- **Queue — next small step (read this first):** **(5) is DONE — closed by this entry** (gate on file, APPROVE, no defect). Next, in order: **(6)** the changelog-prose token split run 900's superseding bullet queued (and run 901's queue dropped) — `php tests/test_changelog_mobile.php` is **124/1** again today; split the five prose tokens over the measured **76**-char cap (**84** in `[0.4.308]` line 9787, **81 + 81** in `[0.4.307]`, **77 + 77** in `[0.4.308]`) following the `[0.4.197]` precedent, **prose in `CHANGELOG.md` only — never a frozen `### Queue` item line**, verify the max token falls back to exactly **76**, confirm no other suite pins those exact lines, and carry its own `CHANGELOG.md` heading; then the standing lines unchanged: **(2'')** the day the `GETTING_STARTED.md` **keep/fold/retire** answer arrives (STEP 0: **0 unread / 0 owed**), execute it as its own small step; **(93)**/**(97)(a)** first if the investor answers `hiring/queue/*.json` (**2 proposed**: `marco-steiner`, `ruben-stoll`) — **withdrawing or approving is never this desk's move**; **A12/A30** keep their named cause (three failed `identity-run@{dispatcher,mia,sofia}.service` — other desks', **no `reset-failed`, no restart**), and the 504/rate-limit classes both still want **operator-level** standing watches; **A28** stays clear unless another desk lands `tests/`+`tools/` code without docs; **(av)(d)** after the `REPORT.md` §14 sign-off (**still no `rm` without it**), **(i)** blocked by the live writers until the prune lands; **SOA MNAME placeholder**, **§14's open blocks** and **Pip's mail-policy research** stay NEEDS-INVESTOR; the **`[0.4.258]`** citation watch stays discharged; **Pip's nine gaps**, **(ax)**, **(e)**, the drift-verify line, **(aw)** and the `promote-gates` verdict watch stay closed/landed exactly as previously recorded.
+
+- **Close-state:** this entry is appended **before** the commit that carries it (CLOSE PROTOCOL rule 1) and is never `git checkout --`-ed, staged-only or parked in `/tmp` (rules 2–3); the stop-state check is `git status --porcelain` **not listing `agent-logs/PROGRESS.md`** after it. A second commit this run (post-push close readings) re-appends before commit #2.
> build · mimo-v2.6-flash-free
[0m$ [0mcd /data/repo && git status --porcelain | head -20; echo "---staged:"; git diff --cached --name-only | head -20
M agent-logs/PROGRESS.md
?? mailboxes/main-to-reviewer/REVIEW-20261012T021504Z-ts5d-g2-pin.md
?? mailboxes/reviewer-to-main/VERDICT-20261012T021504Z-ts5d-g2-pin.md
---staged:
> build · mimo-v2.6-flash-free
[0m$ [0mcd /data/repo && git add -- agent-logs/PROGRESS.md mailboxes/main-to-reviewer/REVIEW-20261012T021504Z-ts5d-g2-pin.md mailboxes/reviewer-to-main/VERDICT-20261012T021504Z-ts5d-g2-pin.md && git commit -- agent-logs/PROGRESS.md mailboxes/main-to-reviewer/REVIEW-20261012T021504Z-ts5d-g2-pin.md mailboxes/reviewer-to-main/VERDICT-20261012T021504Z-ts5d-g2-pin.md -m "run 902: queue item (5) closed - scoped retroactive reviewer gate over the epoch-ts repair's tests (tests/test_ts_ordering.php section 5d + coupled G2 pin), swept ungated into 9c0bca9 by run 987's rate-limit cut-off: VERDICT APPROVE (nemotron-3-ultra-free, read-only, 0.00 EUR) with independent re-runs 18/0 and 350/0/0, all five judgement calls accepted, hazards a-d checked (no live-DB write path, fail-closed regex, non-vacuous fixtures, G2 cannot be satisfied by a skipped 5d: total drops 18->16); no code change since no defect named, tests/tools/app byte-identical to f98582a, no changelog heading owed, dev+prod untouched 0.4.28; STEP 0 0/0 no row written, changelog_mobile 124/1 re-measured and queued as (6), spend 0.00" && git log --oneline -1 && git status --porcelain | head
error: pathspec '-m' did not match any file(s) known to git
error: pathspec 'run 902: queue item (5) closed - scoped retroactive reviewer gate over the epoch-ts repair's tests (tests/test_ts_ordering.php section 5d + coupled G2 pin), swept ungated into 9c0bca9 by run 987's rate-limit cut-off: VERDICT APPROVE (nemotron-3-ultra-free, read-only, 0.00 EUR) with independent re-runs 18/0 and 350/0/0, all five judgement calls accepted, hazards a-d checked (no live-DB write path, fail-closed regex, non-vacuous fixtures, G2 cannot be satisfied by a skipped 5d: total drops 18->16); no code change since no defect named, tests/tools/app byte-identical to f98582a, no changelog heading owed, dev+prod untouched 0.4.28; STEP 0 0/0 no row written, changelog_mobile 124/1 re-measured and queued as (6), spend 0.00' did not match any file(s) known to git
> build · mimo-v2.6-flash-free
[0m$ [0mcd /data/repo && git commit -m "run 902: queue item (5) closed - scoped retroactive reviewer gate over the epoch-ts repair's tests (tests/test_ts_ordering.php section 5d + coupled G2 pin), swept ungated into 9c0bca9 by run 987's rate-limit cut-off: VERDICT APPROVE (nemotron-3-ultra-free, read-only, 0.00 EUR) with independent re-runs 18/0 and 350/0/0, all five judgement calls accepted, hazards a-d checked (no live-DB write path, fail-closed regex, non-vacuous fixtures, G2 cannot be satisfied by a skipped 5d: total drops 18->16); no code change since no defect named, tests/tools/app byte-identical to f98582a, no changelog heading owed, dev+prod untouched 0.4.28; STEP 0 0/0 no row written, changelog_mobile 124/1 re-measured and queued as (6), spend 0.00" -- agent-logs/PROGRESS.md mailboxes/main-to-reviewer/REVIEW-20261012T021504Z-ts5d-g2-pin.md mailboxes/reviewer-to-main/VERDICT-20261012T021504Z-ts5d-g2-pin.md && git log --oneline -1 && git show --stat HEAD | tail -6 && git status --porcelain | head
[main ace886b] run 902: queue item (5) closed - scoped retroactive reviewer gate over the epoch-ts repair's tests (tests/test_ts_ordering.php section 5d + coupled G2 pin), swept ungated into 9c0bca9 by run 987's rate-limit cut-off: VERDICT APPROVE (nemotron-3-ultra-free, read-only, 0.00 EUR) with independent re-runs 18/0 and 350/0/0, all five judgement calls accepted, hazards a-d checked (no live-DB write path, fail-closed regex, non-vacuous fixtures, G2 cannot be satisfied by a skipped 5d: total drops 18->16); no code change since no defect named, tests/tools/app byte-identical to f98582a, no changelog heading owed, dev+prod untouched 0.4.28; STEP 0 0/0 no row written, changelog_mobile 124/1 re-measured and queued as (6), spend 0.00
3 files changed, 117 insertions(+)
create mode 100644 mailboxes/main-to-reviewer/REVIEW-20261012T021504Z-ts5d-g2-pin.md
create mode 100644 mailboxes/reviewer-to-main/VERDICT-20261012T021504Z-ts5d-g2-pin.md
ace886b run 902: queue item (5) closed - scoped retroactive reviewer gate over the epoch-ts repair's tests (tests/test_ts_ordering.php section 5d + coupled G2 pin), swept ungated into 9c0bca9 by run 987's rate-limit cut-off: VERDICT APPROVE (nemotron-3-ultra-free, read-only, 0.00 EUR) with independent re-runs 18/0 and 350/0/0, all five judgement calls accepted, hazards a-d checked (no live-DB write path, fail-closed regex, non-vacuous fixtures, G2 cannot be satisfied by a skipped 5d: total drops 18->16); no code change since no defect named, tests/tools/app byte-identical to f98582a, no changelog heading owed, dev+prod untouched 0.4.28; STEP 0 0/0 no row written, changelog_mobile 124/1 re-measured and queued as (6), spend 0.00
run 902: queue item (5) closed - scoped retroactive reviewer gate over the epoch-ts repair's tests (tests/test_ts_ordering.php section 5d + coupled G2 pin), swept ungated into 9c0bca9 by run 987's rate-limit cut-off: VERDICT APPROVE (nemotron-3-ultra-free, read-only, 0.00 EUR) with independent re-runs 18/0 and 350/0/0, all five judgement calls accepted, hazards a-d checked (no live-DB write path, fail-closed regex, non-vacuous fixtures, G2 cannot be satisfied by a skipped 5d: total drops 18->16); no code change since no defect named, tests/tools/app byte-identical to f98582a, no changelog heading owed, dev+prod untouched 0.4.28; STEP 0 0/0 no row written, changelog_mobile 124/1 re-measured and queued as (6), spend 0.00
agent-logs/PROGRESS.md | 22 +++++++++
.../REVIEW-20261012T021504Z-ts5d-g2-pin.md | 38 +++++++++++++++
.../VERDICT-20261012T021504Z-ts5d-g2-pin.md | 57 ++++++++++++++++++++++
3 files changed, 117 insertions(+)
> build · mimo-v2.6-flash-free
[0m$ [0mcd /data/repo && git push origin main 2>&1 | tail -3; echo "push_rc=$?"; git status -sb | head -2; git rev-list --count origin/main..main; git status --porcelain | wc -l
To git://git.gladex.de/gladex.git
092f0c6..ace886b main -> main
push_rc=0
## main...origin/main
0
0
> build · mimo-v2.6-flash-free
[0m$ [0mcd /data/repo && timeout 300 ./tools/system-status 2>&1 | grep -E "^\[|Overall|git-tree|queue-source|investor-duty|loop-outcomes|failed-units|log-truncation" | head -20
failed-units [FAIL] 3 failed: identity-run@dispatcher.service rc=1 shift_exit=1 work=1144ins/1files, identity-run@mia.service rc=1 shift_exit=1 work=0, identity-run@sofia.service rc=1 shift_exit=1 work=2ins/1files
log-truncation [WARN] identity-dispatcher.md now=1277 was=18062@e0bc90d (-92%), identity-jonas.md now=1955 was=81499@8c15565 (-97%)
loop-outcomes [OK] run 1026 exit=0, streak=0, window 40: 2 ok / 37 red, 37 rate-limited, 1 in-flight
investor-duty [OK] owed=0 unread=0 unreplied=0 open=0
git-tree [OK] clean
red-watch [WARN] red, failed=4, since 2026-10-11T10:16:58Z, 7m old; FAIL A3 tree clean AND in sync with origin/main (kind=is key=git) ;; FAIL A12 system-status verdict - checks in error: failed-units (kind=is key=sysverdict) ;; FAIL A15 git-tree reports a clean tree (kind=contains key=sys) ;; FAIL A30 no unit is left in systemctl --failed (kind=contains key=sys)
queue-source [OK] one queue: [0.4.310] pointer-only, 111 item line(s) frozen across 265 section(s), 203 PROGRESS bullet(s), 2 path token(s)
Overall: 1 CHECK(S) FAILED
[0m$ [0mcd /data/repo && timeout 300 ./tools/red-watch 2>&1 | tail -8; echo "=== queue-source"; ./tools/queue-source-check 2>&1 | tail -2; echo "rc=$?"
red-watch: state=red monitor_exit=1 passed=24 failed=2 alert=RED-SET
FAIL A12 system-status verdict - checks in error: failed-units (kind=is key=sysverdict want=HEALTHY)
FAIL A30 no unit is left in systemctl --failed (kind=contains key=sys want=[OK] 0 failed unit(s))
log=/data/agent-logs/red-watch-20261012.log
alerts=/data/agent-logs/red-watch-ALERTS.log
=== queue-source
queue-source-check: OK - one queue: [0.4.310] pointer-only, 111 item line(s) frozen across 265 section(s), 203 PROGRESS bullet(s), 2 path token(s)
rc=0
> build · mimo-v2.6-flash-free
[0m$ [0mcd /data/repo && ./tools/inbox-status 2>&1 | tail -3; echo "rc=$?"; ./tools/version-check; ./tools/healthcheck 2>&1 | tail -4; ./tools/budget-show 2>&1 | grep -E "2026-10|remaining" | tail -3; for db in /opt/startup/dev/data/messages.db /opt/startup/prod/data/messages.db; do sqlite3 "file:$db?mode=ro" "SELECT count(*) FROM messages WHERE direction='investor_to_agent' AND read=0;"; done
INBOX.md : 80 entries, 80 handled, 0 open
verdict: OK - nothing owed (0 unread, 0 open entries all replied)
rc=0
OK: dev=0.4.28 prod=0.4.28 (match)
Response: {"status":"ok","service":"gladex-investor-app","env":"dev","timestamp":1791772221,"version":"0.4.28"}
prod: HEALTHY
HTTP: 200
Response: {"status":"ok","service":"gladex-investor-app","env":"prod","timestamp":1791772221,"version":"0.4.28"}
Month: 2026-10
- 2026-10-01: month rolled per brief §4 (balance resets to 5.00 on the 1st, unspent does NOT roll over). September history above is kept verbatim; September closed at spent 1.50 / remaining 3.50.
- 2026-10-02: October opened at spent 0.00 / remaining 5.00 because no October charge exists in any file on this box — while gladex.de is a known 1.50/mo recurring cost with NO renewal date recorded anywhere. Figure to be corrected the moment the investor answers REPORT.md §14.
0
0
> build · mimo-v2.6-flash-free
All close readings in. Re-appending the close-readings block before commit #2 (CLOSE PROTOCOL rule 2).
[0m✗ [0mEdit repo/agent-logs/PROGRESS.md failed
[91m[1mError: [0mFound 3 matches for oldString, but expected exactly one. Add more surrounding context to make oldString unique, or set replaceAll to true to replace every occurrence.
> build · mimo-v2.6-flash-free
[0m$ [0mcd /data/repo && cat >> agent-logs/PROGRESS.md <<'RUN902EOF'
- **Close readings (post-push, read at this instant — commit #2, entry re-appended before it per CLOSE PROTOCOL rule 2).** `git push origin main` → **`092f0c6..ace886b`, rc 0**; `git status -sb` → `## main...origin/main`, `git rev-list --count origin/main..main` → **0**; `git status --porcelain` → **empty** before this block and **`agent-logs/PROGRESS.md` NOT listed after commit #2** (the stop-state check — commit #1 `ace886b` carried exactly three paths, **117 insertions / 0 deletions**, staged by explicit pathspec). `./tools/red-watch` run **fresh after the push** → **`state=red, passed=24, failed=2`** = **A12 + A30 only** (`system-status verdict` / `no unit left in systemctl --failed`) — i.e. **A3** (tree in sync) and **A15** (`git-tree` clean) are **both cleared by this commit**, and the two remaining reds are the three other desks' failed `identity-run@{dispatcher,mia,sofia}.service` units, **untouched from here** (no `reset-failed`, no restart). `./tools/system-status` → **`git-tree [OK] clean`**, **`queue-source [OK] one queue: [0.4.310] pointer-only … 265 section(s)`**, **`investor-duty [OK] owed=0 unread=0 unreplied=0 open=0`**, **`loop-outcomes [OK] run 1026 exit=0, streak=0, window 40: 2 ok / 37 red, 37 rate-limited, 1 in-flight`**, `log-truncation [WARN]` still naming the two other desks' transcripts, `failed-units [FAIL] 3 failed: identity-run@{dispatcher,mia,sofia}.service` = the one error, `Overall: 1 CHECK(S) FAILED` = that one row (run 901's own row stayed green and now names run 1026 as its measured `ok`). Also green at the close: `./tools/queue-source-check` → **rc 0** (`[0.4.310]`, **111** frozen item lines unmoved — this run added no `### Queue` line), `./tools/inbox-status` → **rc 0, nothing owed**, `./tools/version-check` → **`OK: dev=0.4.28 prod=0.4.28 (match)`** (**0.4.29 never quoted**), `./tools/healthcheck` → **dev + prod HTTP 200, both 0.4.28**, `./tools/budget-show` → **2026-10 5.00 / 0.00 / 5.00**, spend **0.00**. **STEP 0 re-read at the very close: unread `investor_to_agent` = 0 dev / 0 prod** (`?mode=ro` reads), **no `agent_to_investor` row written in either database, nothing marked read, `INBOX.md` untouched.** **No `systemctl`, no unit or timer change, no `rm`, no live messages DB write, no DNS write, no mail sent, no paid API, no API key**, spend **0.00**, free `*-free` models only (`opencode/mimo-v2.6-flash-free`; reviewer `opencode/nemotron-3-ultra-free`).
RUN902EOF
tail -c 200 agent-logs/PROGRESS.md; echo; git status --porcelain
live messages DB write, no DNS write, no mail sent, no paid API, no API key**, spend **0.00**, free `*-free` models only (`opencode/mimo-v2.6-flash-free`; reviewer `opencode/nemotron-3-ultra-free`).
M agent-logs/PROGRESS.md
> build · mimo-v2.6-flash-free
[0m$ [0mcd /data/repo && git commit -m "run 902 close: post-push readings appended - 092f0c6..ace886b pushed rc 0, in sync rev-list 0, PROGRESS not in git status; red-watch 24 passed / 2 failed = A12+A30 (three other desks' failed units) only, so A3+A15 cleared by the push; system-status git-tree/queue-source/investor-duty/loop-outcomes all OK, Overall 1 CHECK = failed-units only; inbox rc 0, version-check 0.4.28 match (0.4.29 never quoted), healthcheck 2 x HEALTHY, budget 2026-10 5.00/0.00/5.00; STEP 0 still 0/0 with no row written, spend 0.00" -- agent-logs/PROGRESS.md && git log --oneline -2 && echo "--- stop-state:" && git status --porcelain | wc -l && git status --porcelain | grep -c "agent-logs/PROGRESS.md"; echo "grep_rc=$? (1 = PROGRESS not listed, good)"
[main d045a4a] run 902 close: post-push readings appended - 092f0c6..ace886b pushed rc 0, in sync rev-list 0, PROGRESS not in git status; red-watch 24 passed / 2 failed = A12+A30 (three other desks' failed units) only, so A3+A15 cleared by the push; system-status git-tree/queue-source/investor-duty/loop-outcomes all OK, Overall 1 CHECK = failed-units only; inbox rc 0, version-check 0.4.28 match (0.4.29 never quoted), healthcheck 2 x HEALTHY, budget 2026-10 5.00/0.00/5.00; STEP 0 still 0/0 with no row written, spend 0.00
1 file changed, 2 insertions(+)
d045a4a run 902 close: post-push readings appended - 092f0c6..ace886b pushed rc 0, in sync rev-list 0, PROGRESS not in git status; red-watch 24 passed / 2 failed = A12+A30 (three other desks' failed units) only, so A3+A15 cleared by the push; system-status git-tree/queue-source/investor-duty/loop-outcomes all OK, Overall 1 CHECK = failed-units only; inbox rc 0, version-check 0.4.28 match (0.4.29 never quoted), healthcheck 2 x HEALTHY, budget 2026-10 5.00/0.00/5.00; STEP 0 still 0/0 with no row written, spend 0.00
ace886b run 902: queue item (5) closed - scoped retroactive reviewer gate over the epoch-ts repair's tests (tests/test_ts_ordering.php section 5d + coupled G2 pin), swept ungated into 9c0bca9 by run 987's rate-limit cut-off: VERDICT APPROVE (nemotron-3-ultra-free, read-only, 0.00 EUR) with independent re-runs 18/0 and 350/0/0, all five judgement calls accepted, hazards a-d checked (no live-DB write path, fail-closed regex, non-vacuous fixtures, G2 cannot be satisfied by a skipped 5d: total drops 18->16); no code change since no defect named, tests/tools/app byte-identical to f98582a, no changelog heading owed, dev+prod untouched 0.4.28; STEP 0 0/0 no row written, changelog_mobile 124/1 re-measured and queued as (6), spend 0.00
--- stop-state:
0
0
grep_rc=1 (1 = PROGRESS not listed, good)
> build · mimo-v2.6-flash-free
[0m$ [0mcd /data/repo && git push origin main 2>&1 | tail -2; git rev-list --count origin/main..main; git status --porcelain | wc -l
To git://git.gladex.de/gladex.git
ace886b..d045a4a main -> main
0
0
> build · mimo-v2.6-flash-free
Run 902 complete. Summary:
**STEP 0 (investor duty)** — checked first: **0 unread** `investor_to_agent` rows in both `/opt/startup/{dev,prod}/data/messages.db`, all **80/80** INBOX.md entries struck HANDLED, `inbox-status` rc 0 ("nothing owed"). Nothing owed → no row written (an empty inbox is answered by the measurement, not a status message). The 2026-10-05 correction stands: production is **0.4.28**, verified via `version-check` — 0.4.29 never quoted.
**Queue item (5) — done**: the epoch-`ts` repair's tests (§5d in `tests/test_ts_ordering.php` + the coupled G2 pin in `tests/test_regression_run.sh`, swept ungated into `9c0bca9` by run 987's rate-limit cut-off) got their scoped retroactive reviewer gate:
- Request `REVIEW-20261012T021504Z-ts5d-g2-pin.md` → verdict `VERDICT-20261012T021504Z-ts5d-g2-pin.md` = **APPROVE** (reviewer `nemotron-3-ultra-free`, read-only, 0.00 EUR), with **independent re-runs**: `test_ts_ordering` **18/0**, `test_regression_run` **350/0/0**.
- All 5 judgement calls accepted; hazards checked: no live-DB write path, fail-closed regex, non-vacuous fixtures, G2 cannot be satisfied by a silently-skipped §5d.
- No defect named → **no code change**, per the queue. `tests/`/`tools/`/`app/` byte-identical; dev + prod untouched (0.4.28).
**Commits & close protocol**: commit #1 `ace886b` (3 paths, 117 insertions, explicit pathspec) pushed `092f0c6..ace886b`; close readings re-appended, commit #2 `d045a4a` pushed `ace886b..d045a4a`. `git status --porcelain` is **empty** — PROGRESS.md committed, stop-state check green. Post-push red-watch: only A12/A30 remain (three other desks' failed units — untouched, no `reset-failed`).
**Next run's queue** (in PROGRESS.md): **(6)** — split the five changelog prose tokens over the 76-char cap (`changelog_mobile` re-measured **124/1** today; run 901's queue had dropped this item — restored in writing so it can't be lost). Spend: **0.00** (budget 2026-10: 5.00 allowance, 0.00 spent, 5.00 remaining).
exit=0
Select another run log from the list above. Only files matching run-YYYYMMDD-HHMMSS-N.log are readable.
App log tail — prod-8001.log (last 60 lines)
[Mon Oct 12 04:59:43 2026] 127.0.0.1:41546 Accepted [Mon Oct 12 04:59:43 2026] 127.0.0.1:41546 Closing [Mon Oct 12 04:59:43 2026] 127.0.0.1:41558 Accepted [Mon Oct 12 04:59:43 2026] 127.0.0.1:41558 Closing [Mon Oct 12 04:59:43 2026] 127.0.0.1:41562 Accepted [Mon Oct 12 04:59:44 2026] 127.0.0.1:41562 Closing [Mon Oct 12 04:59:44 2026] 127.0.0.1:41574 Accepted [Mon Oct 12 04:59:44 2026] 127.0.0.1:41574 Closing [Mon Oct 12 04:59:44 2026] 127.0.0.1:41586 Accepted [Mon Oct 12 04:59:44 2026] 127.0.0.1:41586 Closing [Mon Oct 12 04:59:44 2026] 127.0.0.1:41602 Accepted [Mon Oct 12 04:59:44 2026] 127.0.0.1:41602 Closing [Mon Oct 12 05:00:00 2026] 127.0.0.1:48554 Accepted [Mon Oct 12 05:00:00 2026] 127.0.0.1:48554 Closing [Mon Oct 12 05:00:01 2026] 127.0.0.1:48570 Accepted [Mon Oct 12 05:00:01 2026] 127.0.0.1:48570 Closing [Mon Oct 12 05:00:18 2026] 127.0.0.1:58952 Accepted [Mon Oct 12 05:00:18 2026] 127.0.0.1:58952 Closing [Mon Oct 12 05:00:20 2026] 127.0.0.1:58958 Accepted [Mon Oct 12 05:00:20 2026] 127.0.0.1:58958 Closing [Mon Oct 12 05:00:20 2026] 127.0.0.1:58962 Accepted [Mon Oct 12 05:00:20 2026] 127.0.0.1:58962 Closing [Mon Oct 12 05:00:20 2026] 127.0.0.1:58966 Accepted [Mon Oct 12 05:00:20 2026] 127.0.0.1:58966 Closing [Mon Oct 12 05:00:20 2026] 127.0.0.1:58968 Accepted [Mon Oct 12 05:00:20 2026] 127.0.0.1:58968 Closing [Mon Oct 12 05:00:20 2026] 127.0.0.1:58972 Accepted [Mon Oct 12 05:00:20 2026] 127.0.0.1:58972 Closing [Mon Oct 12 05:00:20 2026] 127.0.0.1:58986 Accepted [Mon Oct 12 05:00:20 2026] 127.0.0.1:58986 Closing [Mon Oct 12 05:00:20 2026] 127.0.0.1:58988 Accepted [Mon Oct 12 05:00:20 2026] 127.0.0.1:58988 Closing [Mon Oct 12 05:00:20 2026] 127.0.0.1:58994 Accepted [Mon Oct 12 05:00:20 2026] 127.0.0.1:58994 Closing [Mon Oct 12 05:00:20 2026] 127.0.0.1:59008 Accepted [Mon Oct 12 05:00:21 2026] 127.0.0.1:59008 Closing [Mon Oct 12 05:00:21 2026] 127.0.0.1:59014 Accepted [Mon Oct 12 05:00:21 2026] 127.0.0.1:59014 Closing [Mon Oct 12 05:00:34 2026] 127.0.0.1:60498 Accepted [Mon Oct 12 05:00:34 2026] 127.0.0.1:60498 Closing [Mon Oct 12 05:00:34 2026] 127.0.0.1:60504 Accepted [Mon Oct 12 05:00:34 2026] 127.0.0.1:60504 Closing [Mon Oct 12 05:00:34 2026] 127.0.0.1:60516 Accepted [Mon Oct 12 05:00:34 2026] 127.0.0.1:60516 Closing [Mon Oct 12 05:00:34 2026] 127.0.0.1:60528 Accepted [Mon Oct 12 05:00:34 2026] 127.0.0.1:60528 Closing [Mon Oct 12 05:00:34 2026] 127.0.0.1:60532 Accepted [Mon Oct 12 05:00:34 2026] 127.0.0.1:60532 Closing [Mon Oct 12 05:00:34 2026] 127.0.0.1:60548 Accepted [Mon Oct 12 05:00:34 2026] 127.0.0.1:60548 Closing [Mon Oct 12 05:00:34 2026] 127.0.0.1:60560 Accepted [Mon Oct 12 05:00:35 2026] 127.0.0.1:60560 Closing [Mon Oct 12 05:00:35 2026] 127.0.0.1:51758 Accepted [Mon Oct 12 05:00:35 2026] 127.0.0.1:51758 Closing [Mon Oct 12 05:00:35 2026] 127.0.0.1:51764 Accepted [Mon Oct 12 05:00:35 2026] 127.0.0.1:51764 Closing [Mon Oct 12 05:00:35 2026] 127.0.0.1:51772 Accepted [Mon Oct 12 05:00:35 2026] 127.0.0.1:51772 Closing [Mon Oct 12 05:00:59 2026] 127.0.0.1:38298 Accepted
Generated 2026-10-12 03:00:59 UTC · Gladex.de